*HEADING
CANTILEVER WITH CONTINUUM ELEMENTS--END SHEAR, CPS4R, 4 X 4 MESH
EXPLICIT ANALYSIS WITH ENHANCED HOURGLASS CONTROL
*PREPRINT,MODEL=YES,ECHO=NO,HISTORY=YES
*NODE
*NGEN,NSET=FIX1
*NGEN,NSET=FREE1
*NFILL,NSET=MIDDLE
FIX1,FREE1,4
*NSET,NSET=SL1
*NSET,NSET=SL2
*NSET,NSET=QA_TEST_ALLNODES
FIX1,FREE1,MIDDLE
*ELEMENT,TYPE=CPS4R,ELSET=EALL
*ELGEN,ELSET=EALL
*MATERIAL,NAME=STEEL
*ELASTIC
1E8,0.
*DENSITY
0.25
*SOLID SECTION,MATERIAL=STEEL,ELSET=EALL,CONTROLS=HGLASS
0.01
*SECTION CONTROLS,NAME=HGLASS,HOURGLASS=ENHANCED
*AMPLITUDE,NAME=LOAD,DEFINITION=SMOOTH STEP
0.0,0.0,0.1,1.0
*STEP
*DYNAMIC,EXPLICIT
,0.2
*BULK VISCOSITY
*BOUNDARY,TYPE=DISPLACEMENT
FIX1,1,2
*CLOAD,AMPLITUDE=LOAD
SL1,2,-0.125
SL2,2,-0.25
*OUTPUT,FIELD,NUMBER INTERVAL=3
*ELEMENT OUTPUT
S,E,
*NODE OUTPUT
U,
*OUTPUT,HISTORY,TIME INTERVAL=1e-3
*NODE OUTPUT, NSET=FIX1
RF2
*NODE OUTPUT,NSET=FREE1
U2
*ENERGY OUTPUT
ALLAE,ALLCD,ALLKE,ALLIE,ALLWK,ETOTAL,ALLSE
**********************************
** OUTPUT FOR ABAQUS QA PURPOSES
**********************************
*OUTPUT, FIELD, NUMBER INTERVAL=4, TIMEMARKS=YES
*NODE OUTPUT, NSET=QA_TEST_ALLNODES
U,
*FILE OUTPUT,NUMBER INTERVAL=4, TIMEMARKS=YES
U
*NODE FILE,NSET=QA_TEST_ALLNODES
*END STEP