*HEADING
 SKEW-SENSITIVITY ANALYSIS, 30 DEG PARALLELOGRAM, CPS4R, 1 X 8 MESH
 EXPLICIT ANALYSIS WITH ENHANCED HOURGLASS CONTROL
*NODE
*NGEN,NSET=MIDDLE
*NSET,NSET=FIX
*NSET,NSET=END
*NSET,NSET=QA_TEST_ALLNODES
FIX,END,MIDDLE
*ELEMENT,TYPE=CPS4R
*ELGEN,ELSET=EALL
*MATERIAL,NAME=A1
*ELASTIC
1.E8,0.
*DENSITY
0.25
*SOLID SECTION,MATERIAL=A1,ELSET=EALL,CONTROLS=HGLASS
0.01
*SECTION CONTROLS,NAME=HGLASS,HOURGLASS=ENHANCED
*AMPLITUDE,NAME=LOAD,DEFINITION=SMOOTH STEP
0.0,0.0,0.1,1.0
*STEP
*DYNAMIC,EXPLICIT
,0.2
*BULK VISCOSITY
*BOUNDARY,TYPE=DISPLACEMENT
FIX,1,2
*CLOAD,AMPLITUDE=LOAD
17,2,-.5
417,2,-.5
*OUTPUT,FIELD,NUMBER INTERVAL=3
*ELEMENT OUTPUT
S,E,
*NODE OUTPUT
U,
*OUTPUT,HISTORY,TIME INTERVAL=.2e-2
*NODE OUTPUT, NSET=FIX
RF2
*NODE OUTPUT,NSET=END
U2
*ENERGY OUTPUT
ALLAE,ALLCD,ALLKE,ALLIE,ALLWK,ETOTAL,ALLSE
**********************************
** OUTPUT FOR ABAQUS QA PURPOSES
**********************************
*OUTPUT, FIELD, NUMBER INTERVAL=4, TIMEMARKS=YES
*NODE OUTPUT, NSET=QA_TEST_ALLNODES
U,
*FILE OUTPUT,NUMBER INTERVAL=4, TIMEMARKS=YES
*NODE FILE,NSET=QA_TEST_ALLNODES
U
*END STEP