*HEADING
 SKEW-SENSITIVITY ANALYSIS, 30 DEG TRAPEZOIDAL, C3D8I, 1 X 8 MESH
 EXPLICIT ANALYSIS
*NODE,NSET=NALL
*NGEN,NSET=NALL
*NCOPY, OLD SET=NALL, CHANGE NUMBER=1000, SHIFT,NEW SET=NALL1
*NSET,NSET=QA_TEST_ALLNODES
NALL,NALL1
*NSET,NSET=FIX
*NSET,NSET=END
*NSET, NSET=N1,GENERATE
*ELEMENT,TYPE=C3D8I
*ELGEN,ELSET=EALL
*MATERIAL,NAME=A1
*ELASTIC
1.E8,0.
*DENSITY
0.25
*SOLID SECTION,MATERIAL=A1,ELSET=EALL
*AMPLITUDE,NAME=LOAD,DEFINITION=SMOOTH
0.0,0.0,0.1,1.0
*STEP
*DYNAMIC,EXPLICIT
,0.2
*BULK VISCOSITY
*BOUNDARY
FIX,1,3
N1, 3,3
*CLOAD,AMPLITUDE=LOAD
17,2,-.25
417,2,-.25
1017,2,-.25
1417,2,-.25
*OUTPUT,FIELD,NUMBER INTERVAL=3
*ELEMENT OUTPUT
S,E
*NODE OUTPUT
U
*OUTPUT,HISTORY,TIME INTERVAL=20e-4
*NODE OUTPUT,NSET=FIX
RF2
*NODE OUTPUT,NSET=END
U2
*ENERGY OUTPUT
ALLAE,ALLCD,ALLKE,ALLIE,ALLWK,ETOTAL,ALLSE
**********************************
** OUTPUT FOR ABAQUS QA PURPOSES
**********************************
*OUTPUT, FIELD, NUMBER INTERVAL=4, TIMEMARKS=YES
*NODE OUTPUT, NSET=QA_TEST_ALLNODES
U,
*FILE OUTPUT,NUMBER INTERVAL=4,TIMEMARKS=YES
*NODE FILE,NSET=QA_TEST_ALLNODES
U
*END STEP