*HEADING
CANTILEVER WITH CONTINUUM ELEMENTS--END SHEAR, C3D8, 8 X 16 MESH
EXPLICIT ANALYSIS
*PREPRINT,MODEL=YES,ECHO=NO,HISTORY=YES
*NODE
*NGEN,NSET=FIX1
*NGEN,NSET=FIX2
*NGEN,NSET=FREE1
*NGEN,NSET=FREE2
*NFILL,NSET=MIDDLE
FIX1,FREE1,16
FIX2,FREE2,16
*NSET,NSET=SL1
*NSET,NSET=SL2
*NSET,NSET=QA_TEST_ALLNODES
FIX1,FIX2,FREE1,FREE2,MIDDLE
*ELEMENT,TYPE=C3D8,ELSET=EALL
*ELGEN,ELSET=EALL
*MATERIAL,NAME=STEEL
*ELASTIC
1E8,0.
*DENSITY
0.25
*SOLID SECTION,MATERIAL=STEEL,ELSET=EALL
*AMPLITUDE,NAME=LOAD,DEFINITION=SMOOTH
0.0,0.0,0.1,1.0
*STEP
*DYNAMIC,EXPLICIT
,0.2
*BULK VISCOSITY
*BOUNDARY,TYPE=DISPLACEMENT
FIX1,1,3
FIX2,1,3
*CLOAD,AMPLITUDE=LOAD
SL1,2,-3.125
SL2,2,-6.25
*OUTPUT,FIELD,NUMBER INTERVAL=3
*ELEMENT OUTPUT
S,E
*NODE OUTPUT
U
*OUTPUT,HISTORY,TIME INTERVAL=20e-4
*NODE OUTPUT,NSET=FIX1
RF2
*NODE OUTPUT,NSET=FIX2
RF2
*NODE OUTPUT,NSET=FREE1
U2
*ENERGY OUTPUT
ALLAE,ALLCD,ALLKE,ALLIE,ALLWK,ETOTAL,ALLSE
**********************************
** OUTPUT FOR ABAQUS QA PURPOSES
**********************************
*OUTPUT, FIELD, NUMBER INTERVAL=4, TIMEMARKS=YES
*NODE OUTPUT, NSET=QA_TEST_ALLNODES
U,
*FILE OUTPUT,NUMBER INTERVAL=4,TIMEMARKS=YES
*NODE FILE,NSET=QA_TEST_ALLNODES
U
*END STEP