*Heading
** Job name: eulerian_rodimpact_fine Model name: Model-1
** Generated by: Abaqus/CAE 6.12-DEV
*Preprint, echo=NO, model=NO, history=NO, contact=NO
**
** PARTS
**
*Part, name=Part-1
*Node
*Element, type=EC3D8R
*Nset, nset=_PickedSet2, internal, generate
*Elset, elset=_PickedSet2, internal, generate
** Section: Section-1
*Eulerian Section, elset=_PickedSet2
copper, copper-1
*Surface, type=EULERIAN MATERIAL, name=copper-1
copper-1
*End Part
**
*Part, name=Part-2
*End Part
**
**
** ASSEMBLY
**
*Assembly, name=Assembly
**
*Instance, name=Part-1-1, part=Part-1
*End Instance
**
*Instance, name=Part-2-1, part=Part-2
*End Instance
**
*Nset, nset=xsymm, instance=Part-1-1, generate
*Elset, elset=xsymm, instance=Part-1-1, generate
*Nset, nset=ysymm, instance=Part-1-1, generate
*Elset, elset=ysymm, instance=Part-1-1, generate
*Nset, nset=zsymm, instance=Part-1-1
*Elset, elset=zsymm, instance=Part-1-1
*Nset, nset=all, instance=Part-1-1, generate
*Elset, elset=all, instance=Part-1-1, generate
*Nset, nset=_PickedSet14, internal, instance=Part-1-1, generate
*Elset, elset=_PickedSet14, internal, instance=Part-1-1, generate
*Nset, nset=_PickedSet16, internal, instance=Part-1-1, generate
*Elset, elset=_PickedSet16, internal, instance=Part-1-1, generate
*Nset, nset=Set-6, instance=Part-1-1
*Elset, elset=qa_test_eout, instance=Part-1-1
*Nset, nset=qa_test_nout, instance=Part-1-1
*End Assembly
**
** MATERIALS
**
*Material, name=copper
*Density
8970.,
*Elastic
 1.1e+11, 0.3
*Plastic
 3.14e+08,0.
**
** PREDEFINED FIELDS
**
** Name: Predefined Field-1   Type: Velocity
*Initial Conditions, type=VELOCITY
all, 1, 0.
all, 2, 0.
all, 3, -227.
** Name: Predefined Field-2   Type: Material assignment
*Initial Conditions, type=VOLUME FRACTION
Part-1-1.26974, Part-1-1.copper-1, 4.57764e-05
Part-1-1.26975, Part-1-1.copper-1, 0.00012207
Part-1-1.26976, Part-1-1.copper-1, 7.62939e-05
Part-1-1.27006, Part-1-1.copper-1, 0.000152588
Part-1-1.27007, Part-1-1.copper-1, 0.110016
Part-1-1.27008, Part-1-1.copper-1, 0.244873
Part-1-1.27038, Part-1-1.copper-1, 0.000152588
Part-1-1.27039, Part-1-1.copper-1, 0.110016
Part-1-1.27040, Part-1-1.copper-1, 0.244873
Part-1-1.27070, Part-1-1.copper-1, 0.000152588
Part-1-1.27071, Part-1-1.copper-1, 0.110016
Part-1-1.27072, Part-1-1.copper-1, 0.244873
Part-1-1.27102, Part-1-1.copper-1, 0.000152588
Part-1-1.27103, Part-1-1.copper-1, 0.110016
Part-1-1.27104, Part-1-1.copper-1, 0.244873
Part-1-1.27134, Part-1-1.copper-1, 0.000152588
Part-1-1.27135, Part-1-1.copper-1, 0.110016
Part-1-1.27136, Part-1-1.copper-1, 0.244873
Part-1-1.27166, Part-1-1.copper-1, 0.000152588
Part-1-1.27167, Part-1-1.copper-1, 0.110016
** ... 3552 like lines cut
** ----------------------------------------------------------------
**
** STEP: Step-1
**
*Step, name=Step-1
impact
*Dynamic, Explicit
, 8e-05
*Bulk Viscosity
**
** BOUNDARY CONDITIONS
**
** Name: BC-1 Type: Symmetry/Antisymmetry/Encastre
*Boundary
xsymm, XSYMM
** Name: BC-2 Type: Symmetry/Antisymmetry/Encastre
*Boundary
ysymm, YSYMM
** Name: BC-3 Type: Symmetry/Antisymmetry/Encastre
*Boundary
zsymm, ZSYMM
**
** OUTPUT REQUESTS
**
*Restart, write, number interval=1, time marks=NO
**
**
** FIELD OUTPUT: F-Output-1
**
*Output, field, variable=PRESELECT
**
** FIELD OUTPUT: F-Output-2
**
*Output, field
*Element Output, elset=qa_test_eout, directions=YES
PEEQ,
**
** FIELD OUTPUT: F-Output-3
**
*Node Output, nset=qa_test_nout
V,
**
** HISTORY OUTPUT: H-Output-1
**
*Output, history, variable=PRESELECT
*End Step