*HEADING
: EIGENVALUE ANALYSIS OF AN UNCONSTRAINED 1-ELEMENT MESH  [SAX1]
*NODE,NSET=NALL
*ELEMENT,TYPE=SAX1, ELSET=EALL
*SHELL SECTION,MATERIAL=MAT1, ELSET=EALL
 .1, 3
*MATERIAL,NAME=MAT1
*ELASTIC
 30.E6, .3
*DENSITY
7.5E-4,
*STEP
*FREQUENCY, eigensolver=lanczos, SIM=NO
5, , ,-1.E7
*OUTPUT,HISTORY,FREQUENCY=1
*MODAL OUTPUT
*END STEP