*HEADING
COMBINATION OF EOS, HYPERBOLIC DRUCKER PRAGER PLASTICITY, JOHNSON COOK TYPE RATE DEPENDENCY
TENSION TEST
ELEMENT: CPE4R
*node, nset=alln
*element, type=cpe4r,elset=alle
*solid section, elset=alle, material=MAT
*MATERIAL,NAME=MAT, srate factor=0.1
*EOS,TYPE=USUP
*ELASTIC, TYPE=SHEAR
 80.232558E9,
*DRUCKER PRAGER, shear criterion=hyperbolic
*DRUCKER PRAGER HARDENING,type=tension
 100E6.,0.
*RATE DEPENDENT, TYPE=JOHNSON COOK
*DENSITY
 1.E3,
**
**
*boundary
1,1,2
2,2,2
4,1,1
**
*amplitude, name=pull
0,0,0.1,1
**
*STEP
*DYNAMIC,EXPLICIT
,0.1
*BOUNDARY,AMP=pull
3,2,2,0.5
4,2,2,0.5
**
**
*OUTPUT,FIELD,NUMBER INTERVAL=4,TIME MARKS=YES
*ELEMENT OUTPUT,ELSET=alle
PEEQ,S, LE
*NODE OUTPUT,NSET=alln
U,V
*OUTPUT,HISTORY,fre=1
**VARIABLE=PRESELECT,TIME INTERVAL=0.001
*ELEMENT OUTPUT,ELSET=alle
PEEQ, S, LE
*END STEP