*HEADING
 1 - EL PLASTICITY TEST ON SHELL ELEMENT - UNIAXIAL LOAD
*NODE
*NGEN,NSET=NX
*NGEN,NSET=NY
*NGEN
*NSET,NSET=FIXR
*ELEMENT,TYPE=STRI65,ELSET=ONE
*SHELL SECTION,MATERIAL=A1,ELSET=ONE
 .001,3
*MATERIAL,NAME=A1
*ELASTIC
 1.E7, 0.3
*PLASTIC,HARDENING=KINEMATIC
 1.E4,
 5.01E6,0.5
*EQUATION
*AMPLITUDE,NAME=PULL
.10 , 10000. ,  .40 , 25000. ,  .60 , 100. ,  .80 , 30000.
 1. , 100.
*BOUNDARY
 NX,2,6
 NY,1
 NY,3,6
 FIXR,4,6
**RESTART,WRITE,FREQUENCY=2
*STEP,INC=100
  PULL ON SHELL
*STATIC,DIRECT
  .1  ,  1.0
*CLOAD,AMPLITUDE=PULL
 15,1,1.E-3
*EL PRINT
COORD,
LOADS,
S,
SINV,
E,
PE,
IE,
*EL FILE
S,
PE,PEP
*END STEP