*HEADING
 ELEMENT PLASTICITY TEST ON - UNIAXIAL LOAD [SC8R]
*NODE
*NGEN,NSET=NX
*NGEN,NSET=NY
*NGEN
*NSET,NSET=FIXR
*NSET, GEN, NSET=NALL
*ELEMENT,TYPE=SC8R,ELSET=EALL
*SHELL SECTION,MATERIAL=A1,ELSET=EALL
 .001,
*MATERIAL,NAME=A1
*ELASTIC
 1.E7, 0.3
*PLASTIC,HARDENING=KINEMATIC
 1.E4,
 5.01E6,0.5
*EQUATION
*AMPLITUDE,NAME=PULL
.10 , 10000. ,  .40 , 25000. ,  .60 , 100. ,  .80 , 30000.
 1. , 100.
*BOUNDARY
 NX,2
 NY,1
*RESTART,WRITE,FREQUENCY=2
*STEP,INC=100
  PULL
*STATIC,DIRECT
  .1  ,  1.0
*CLOAD,AMPLITUDE=PULL
  15,1,1.0E-3
*NODE PRINT,SUMMARY=NO
U1,U2,RF1,RF2
*EL PRINT,SUMMARY=NO
S,
SINV,
E ,IE
PE,
NFORC,
*EL FILE
S,
SINV,
E, IE
PE,PEP
NFORC,
*OUTPUT, HISTORY
*ELEMENT OUTPUT, ELSET=EALL
 S,
 E,
 PE,
*END STEP