*HEADING
 ONE ELEMENT PLASTICITY TEST ON - UNIAXIAL LOAD
 PLANE STRESS ELEMENT
*NODE
*NGEN,NSET=NX
*NGEN,NSET=NY
*NGEN
*NSET,NSET=FIXR
*ELEMENT,TYPE=CPS8R,ELSET=EALL
*SOLID SECTION,MATERIAL=A1,ELSET=EALL
 .001,
*surface,NAME=SIDE
1,S2
*MATERIAL,NAME=A1
*ELASTIC
 1.E7, 0.3
*PLASTIC,HARDENING=KINEMATIC
 1.E4,
 5.01E6,0.5
*EQUATION
*AMPLITUDE,NAME=PULL
.10 , 10000. ,  .40 , 25000. ,  .60 , 100. ,  .80 , 30000.
 1. , 100.
*BOUNDARY
 NX,2
 NY,1
*RESTART,WRITE,FREQUENCY=2
*STEP,INC=100
  PULL
*STATIC,DIRECT
  .1  ,  1.0
*CLOAD,AMPLITUDE=PULL
 15,1,1.E-3
*NODE PRINT,SUMMARY=NO
U1,U2,RF1,RF2
*EL PRINT,SUMMARY=NO
COORD,S
SINV,
E ,IE
PE,
NFORC,
*EL FILE
S,
PE,PEP
*SECTION PRINT,NAME=SID34,SURFACE=SIDE,AXES=LOCAL
*SECTION FILE, NAME=SID34,SURFACE=SIDE,AXES=LOCAL
*END STEP