*HEADING
 VIBRATION OF A CANTILEVER PLATE  2 X 4 S9R5
*NODE
*NGEN,NSET=END
*NGEN,NSET=FIXED
*NFILL
END,FIXED,8,100
*ELEMENT,TYPE=S9R5
*ELGEN,ELSET=CANTLEVR
*MATERIAL,NAME=STEEL
*ELASTIC
30E6 , 0.3
*DENSITY
0.0007324,
*SHELL SECTION,ELSET=CANTLEVR,MATERIAL=STEEL
0.01  , 3
*BOUNDARY
FIXED ,ENCASTRE
*STEP
*FREQUENCY, eigensolver=lanczos, SIM=NO
 5, ,
*EL PRINT,FREQUENCY=0
*MODAL FILE
*EL PRINT,FREQUENCY=0
*END STEP