*HEADING
 VIBRATION OF A CANTILEVER PLATE   5 X 10  S8R
*PREPRINT,MODEL=NO,HISTORY=NO
*NODE
*NGEN,NSET=END
*NGEN,NSET=FIXED
*NFILL
END,FIXED,20,50
*ELEMENT,TYPE=S8R
*ELGEN,ELSET=CANTLEVR
*MATERIAL,NAME=A1
*ELASTIC
30.E6  , 0.3
*DENSITY
0.0007324,
*SHELL SECTION,MATERIAL=A1,ELSET=CANTLEVR
0.01  , 3
*BOUNDARY
FIXED , 1,6
*STEP
*FREQUENCY, eigensolver=lanczos, SIM=NO
 5, ,
*MODAL FILE
*EL PRINT,FREQUENCY=0
*NODE PRINT
U,
*END STEP