*HEADING
 VIBRATION OF A CANTILEVER PLATE 10 X 20 S8R5
*PREPRINT,MODEL=NO,HISTORY=NO
*NODE
*NGEN,NSET=FIXED
*NGEN,NSET=END
*NFILL
FIXED,END,40,1
*ELEMENT,TYPE=S8R5
*ELGEN,ELSET=CANTLEVR
*MATERIAL,NAME=MAT
*ELASTIC
30.E6 ,0.3
*DENSITY
0.0007324,
*SHELL SECTION,ELSET=CANTLEVR,MATERIAL=MAT
0.01 , 3
*BOUNDARY
FIXED,1,6
**
*STEP
*FREQUENCY, eigensolver=lanczos, SIM=NO
5, ,
*NODE PRINT,FREQUENCY=0
*EL PRINT,FREQUENCY=0
*MODAL FILE
*OUTPUT,FIELD,MODE LIST
*MODAL OUTPUT,VARIABLE=ALL
*NODE OUTPUT
U,
*OUTPUT,HISTORY
*MODAL OUTPUT,VARIABLE=ALL
*END STEP