*HEADING
 VIBRATION OF A CANTILEVER PLATE   5 X 10  S4R5
*NODE
*NGEN,NSET=FIXED
*NGEN,NSET=END
*NFILL
FIXED,END,10,4
*ELEMENT,TYPE=S4R5
*ELGEN,ELSET=CANTLEVR
*MATERIAL,NAME=MAT
*ELASTIC
30.E6  , 0.3
*DENSITY
0.0007324,
*SHELL SECTION,ELSET=CANTLEVR,MATERIAL=MAT
0.01  , 3
*BOUNDARY
FIXED , 1,6
*STEP
*FREQUENCY, eigensolver=lanczos, SIM=NO
 5, ,
*EL PRINT,FREQUENCY=0
*MODAL FILE
*END STEP