*HEADING
: 3D LARGE SLIDING RIGID SURFACE CONTACT, FACETED SURFACE
*RESTART, WRITE, F=10
**
** SHEET DEFINITION
**
*NODE
*NGEN, NSET=EDGE1
*NGEN, NSET=EDGE2
*NFILL, NSET=ALL
EDGE1,EDGE2,10,1
*NSET, NSET=BOTEDG, GENERATE
*NSET, NSET=NPOINT, GENERATE
*ELEMENT, TYPE=S4R, ELSET=SHELL
*ELGEN, ELSET=SHELL
*SHELL SECTION, ELSET=SHELL, MATERIAL=ELASTIC
0.25,
*MATERIAL, NAME=ELASTIC
*ELASTIC
3.0E6, 0.3
**
** RIGID surface
**
*NODE, NSET=CYLSURF
*surface, NAME=B-SURFACE
SHELL,SNEG
*surface, NAME=A-SURFACE
ERIGID,SNEG
*CONTACT PAIR, INTERACTION=SMOOTHSURF, TYPE=SURFACE, NOTHICK
B-SURFACE,A-SURFACE,ORIENT
*SURFACE INTERACTION, NAME=SMOOTHSURF
*ORIENTATION,NAME=ORIENT
*NODE
**
**
*ELEMENT, TYPE=R3D3, ELSET=ERIGID
**
*RIGID BODY, ELSET=ERIGID, REFNODE=100000
**
** BOUNDARY CONDITIONS
**
*BOUNDARY
EDGE1,1,6
CYLSURF,1,6
*STEP, INC=40, NLGEOM, unsymm=yes
*STATIC
0.001,1.0
*DLOAD
SHELL,P,-700.0
*PRINT, CONTACT=YES
*NODE PRINT,FREQ=999
*OUTPUT,FIELD,FREQ=999
*NODE OUTPUT,NSET=BOTEDG
U,
*EL PRINT
S,E
*OUTPUT,FIELD
*ELEMENT OUTPUT
S,E
*CONTACT PRINT,SLAVE=B-SURFACE,MASTER=A-SURFACE,FREQ=9999
*OUTPUT,FIELD,FREQ=9999
*CONTACT OUTPUT,SLAVE=B-SURFACE,MASTER=A-SURFACE
CSTRESS,CDISP
*ENDSTEP