*HEADING
EIG1SRSB: THREE-DIMENSIONAL BEZIER RIGID SURFACE [IRS13]
*RESTART, WRITE, F=10
**
** SHEET DEFINITION
**
*NODE
*NGEN, NSET=EDGE1
*NGEN, NSET=EDGE2
*NFILL, NSET=ALL
EDGE1,EDGE2,10,1
*NSET, NSET=BOTEDG, GENERATE
*ELEMENT, TYPE=S4R, ELSET=SHELL
*ELGEN, ELSET=SHELL
*ELSET,ELSET=CONTACT,GENERATE
*SHELL SECTION, ELSET=SHELL, MATERIAL=ELASTIC
0.25,
*MATERIAL, NAME=ELASTIC
*ELASTIC
3.0E6, 0.3
**
** RIGID surface
**
*RIGID BODY, ELSET=RIGID, REFNODE=10000
*NODE
*ELEMENT,TYPE=R3D3,ELSET=RIGID
*surface,NAME=SRIG
RIGID,SPOS
*surface,NAME=SSOL
CONTACT,SNEG
*SURFACE INTERACTION,NAME=INTER
1.,
*CONTACT PAIR,INTERACTION=INTER, smooth=0.2
SSOL,SRIG
**
** BOUNDARY CONDITIONS
**
*BOUNDARY
EDGE1,1,6
10000,1,6
*STEP, INC=40, NLGEOM, unsymm=yes
*STATIC
0.01,1.0
*DLOAD
SHELL,P,-700.0
*PRINT, CONTACT=YES
*NODE PRINT,FREQ=999
*OUTPUT,FIELD,FREQ=999
*NODE OUTPUT,NSET=BOTEDG
U,
*ENDSTEP