*HEADING
:  2D LARGE SLIDING RIGID SURFACE CONTACT,
FACETED RIGID SURFACE MADE OF DEFORMABLE TO RIGID ELEMENTS (T2D2)
*RESTART,WRITE
********************
*NODE
*NGEN,NSET=ALL
*NSET,NSET=CENTER
*NSET,NSET=LEFT
*NSET,NSET=RIGHT
*ELEMENT,TYPE=CPS4R
*ELGEN,ELSET=BEAM
*SOLID SECTION,ELSET=BEAM,MATERIAL=MAT1
.25,
*MATERIAL,NAME=MAT1
*ELASTIC
30.E6,.3
********************
*NODE
**
**
*ELEMENT, TYPE=T2D2 , ELSET=RBODY
*SOLID SECTION, ELSET=RBODY, MATERIAL=MAT1
*RIGID BODY,ELSET=RBODY,REFNODE=2000
********************
*surface,NAME=DSURF
BEAM,S3
*surface,NAME=RSURF
RBODY,SNEG
*CONTACT PAIR,INTERACTION=INT1
DSURF,RSURF
*SURFACE INTERACTION,NAME=INT1
********************
*BOUNDARY
2000,1,6
LEFT,1
RIGHT,1
CENTER,1
********************
*STEP,NLGEOM,INC=1000
*STATIC
.05,1.
*PRINT,CONTACT=YES
*BOUNDARY
LEFT,2,,0.56
RIGHT,2,,0.56
*EL PRINT
 S,E
*NODE PRINT
U,
*NODE FILE,F=9999
U,
*CONTACT PRINT,MASTER=RSURF,SLAVE=DSURF
*CONTACT FILE,MASTER=RSURF,SLAVE=DSURF,FREQ=9999
*OUTPUT,FIELD,FREQ=999
*CONTACT OUTPUT
CSTRESS,
*NODE OUTPUT
U,
*ELEMENT OUTPUT
S,
*END STEP
*STEP,NLGEOM,INC=1000
*STATIC
.005,1.
*BOUNDARY,OP=NEW
2000,1,6
CENTER,1
*DLOAD
BEAM,P1,1000.
*END STEP