*HEADING
: PURE BENDING OF A THICK WALLED CYLINDER  [CAXA84]
** 6-IN LONG CYLINDER OF 2-IN & 6-IN INNER AND OUTER RADII  (1X1 MESH)
** RIGID BODY MODE IN THE 1 DIRECTION IS ELIMINATED BY THE FOLLOWING EQUATION
*EQUATION
*NODE
*NGEN,NSET=BOT
*NGEN,NSET=TOP
*NFILL,NSET=P000
BOT,TOP,12,10
*ELEMENT,TYPE=CAXA84,OFFSET=1000,ELSET=ALL
*SOLID SECTION,ELSET=ALL,MATERIAL=STEEL
*MATERIAL,NAME=STEEL
*ELASTIC
30.E6,.33
*EXPANSION
0.0001,
*NSET,NSET=BOTTOM,GEN
*NSET,NSET=L1,GEN
*NSET,NSET=L2,GEN
*NSET,NSET=L3,GEN
*ELSET,ELSET=END
*BOUNDARY
BOTTOM,2,2
*NSET,NSET=NFILE
*ELSET,ELSET=EFILE
*STEP
*STATIC
*ENERGY PRINT
*DLOAD
END,P3NU
*EL PRINT,ELSET=EFILE,POSITION=AVERAGED AT NODES
S,
E,
*NODE PRINT,NSET=NFILE,TOTAL=NO
COORD,U1,U2,RF1,RF2
** *NODE PRINT,NSET=L1,TOTAL=NO
** COORD,U1,U2,RF1,RF2
** *NODE PRINT,NSET=L2,TOTAL=NO
** COORD,U1,U2,RF1,RF2
** *NODE PRINT,NSET=L3,TOTAL=NO
** COORD,U1,U2,RF1,RF2
*EL FILE,ELSET=EFILE,POSITION=AVERAGED AT NODES
S,
*NODE FILE,NSET=NFILE
U,
*END STEP