*HEADING
PATCH TEST 1.5.7 [CPEG6MHT]
*PREPRINT,ECHO=YES,HISTORY=NO,MODEL=NO
*NODE,NSET=NALL
*NGEN,NSET=NALL
*NODE
*ELEMENT,TYPE=CPEG6MHT, ELSET=EALL
*NSET,NSET=SIDES,GENERATE
*SOLID SECTION,MATERIAL=A1, ELSET=EALL, REF NODE=999
*MATERIAL,NAME=A1
*ELASTIC
 30e6, 0.0
*CONDUCTIVITY
4.85E-4,
*DENSITY
0.283,
*SPECIFIC HEAT
0.116,
*STEP
 STEADY STATE
*COUPLED TEMPERATURE-DISPLACEMENT,STEADY STATE
*BOUNDARY
10,11, ,  0.0
20,11, , 48.0
30,11, , 60.0
40,11, , 12.0
50,11, , 24.0
60,11, , 54.0
70,11, , 36.0
80,11, ,  6.0
NALL, 1,2
*NODE PRINT, FREQUENCY=0
*EL PRINT
 HFL,
*EL PRINT,POSITION=NODES
 HFL,
*EL PRINT,POSITION=AVERAGED AT NODES
 HFL,
*EL PRINT,POSITION=CENTROID
 HFL,
*ENDSTEP