*HEADING
ECA8AFE1T: EIGENVALUE ANALYSIS OF AN UNCONSTRAINED 1-ELEMENT MESH  [ACAX8(T)]
*NODE, Nset=ODB_NSET
*NGEN,NSET=LEFT
*NGEN,NSET=RIGHT
*NGEN,NSET=BOT
*NGEN,NSET=TOP
*NGEN, Nset=ODB_NSET
**		QUADRILATERAL ELEMENT DEGENERATED TO TRIANGLE
*ELEMENT,TYPE=ACAX8,ELSET=ALL
*SOLID SECTION,MATERIAL=ALL,ELSET=ALL
*MATERIAL,NAME=ALL
*DENSITY
 1.,
*ACOUSTIC MEDIUM,BULK MODULUS
**
** Sets added by addodb
**
*Elset,Elset=ODB_ESET
ALL,
**
**
*Nset, Nset=ODB_NSET
ODB_NSET, LEFT, RIGHT, BOT
TOP,
**
**
*STEP
*FREQUENCY,EIGENSOLVER=AMS
14,,6000.,10.0,4.0,3.0
*OUTPUT,FIELD,FREQUENCY=0
*NODE PRINT,F=0
*EL PRINT,F=0
*OUTPUT,HISTORY,OP=ADD
*MODAL OUTPUT,VARIABLE=ALL
*ENDSTEP