*Heading
 Multistep verification test for cgax4 elements using distributions
*Node
*Nset, nset=side1, generate
*Nset, nset=side3, generate
*Elset, Elset=eall, generate
**------------------------------------------------------------------------------------------
*Material, name=mat1
*Elastic, type=engineering constants
  0.300E+07,  0.400E+07,  0.500E+07,  0.100E+00,  0.200E+00,  0.300E+00,  0.300E+06,  0.400E+06
  0.500E+06,
*Density
  0.750E-03,
*Material, name=Material-mem
*Elastic
 1.e6, 0.3
*Density
 .5e-3
**------------------------------------------------------------------------------------------
*Element, type=cgax4, elset=cax
*Element, type=mgax1, elset=memAx
*Membrane Section, elset=memAx, material=Material-mem, membrane thickness=distmemThick
 1.
*Distribution Table, name=distThickTable
 length
*Distribution, name=distMemThick, table=distThickTable, location=element
*Distribution table, name=OrientationTable
 coord3d, coord3d
*Distribution, name=distOrient, location=element, table=orientationTable
*Distribution Table, name=AngleTable
 angle
*Distribution, name=distAngle, table=AngleTable, location=element
*Solid Section, material=mat1, elset=cax, orientation=ori
1.,
*Orientation, name=ori
 distOrient
 3, distAngle
*Boundary
 side1, 1, 2
 side1, 5, 5
**
** --------------------------------------------------
**
*step, nlgeom=yes, name=step-1
 static
*static
 .25, 1.0
*Boundary
 side3, 1, 1, 0.01
 side3, 5, 5, 0.01
*El print, freq=999
 s,
*Node print, freq=999
 u,
*Output, field, op=new
*Node output
 u,
*Element output
 s,
*end step
**
** --------------------------------------------------
**
*step, perturbation, name=step-2
 static
*static
*El print, freq=999
 s,
*Node print, freq=0
*Output, field, op=new
*Element output
 s,
*load case, name=load1
*dload
 eall, br, 1.e3
*end load case
*load case, name=load2
*dload
 eall, grav, 1.e6, 0.,1.,0.
*end load case
*load case, name=load3
*dload
 eall, cent, 100.,0.,0.,0.,1.,0.
*end load case
*load case, name=load4
*dload
 eall, centrif, 1.e6,0.,0.,0.,1.,0.
*end load case
*end step