*Heading
*Node
*Element, type=C3D10M, elset=cube1
*Solid Section, elset=cube1, material=Material-1, orientation=ori1
 1.,
*Orientation, name=ori1
*Element, type=C3D10M, elset=cube2
*Solid Section, elset=cube2, material=Material-1, orientation=ori2
 1.,
*Orientation, name=ori2
*Element, type=C3D10M, elset=cube3
*Solid Section, elset=cube3, material=Material-1, orientation=ori3
 1.,
*Orientation, name=ori3
*Element, type=C3D10M, elset=cube4
*Solid Section, elset=cube4, material=Material-1, orientation=ori4
 1.,
*Orientation, name=ori4
*Element, type=C3D10M, elset=cube5
*Solid Section, elset=cube5, material=Material-1, orientation=ori5
 1.,
*Orientation, name=ori5
*Element, type=C3D10M, elset=cube6
*Solid Section, elset=cube6, material=Material-1, orientation=ori6
 1.,
*Orientation, name=ori6
*Nset, nset=Fix
*Nset, nset=Load
**
** MATERIALS
**
*Material, name=Material-1
*Elastic, type=ENGINEERING CONSTANTS
 3e+06,  4e+06,  5e+06,    0.1,    0.2,    0.3,300000.,400000.
 500000.,
*Density
 0.750E-1
** 0.750E-3
*Elset, elset=eall, generate
*Boundary
 Fix, 1,3
**
** --------------------------------------------------
*Elset, Elset =QA_TEST
eall,
*Nset, Nset =QA_TEST
Load,
**
*step, nlgeom=yes, name=step-8
 dynamic
*Dynamic, Explicit
 , 1.0
*Amplitude, Name=Smooth, Def=Smooth Step
0., 0., 0.5, 1.0, 1., 1.
*Boundary, AMP=Smooth
 load, 1, 1, 0.025
 load, 2, 2, 0.050
*Output, field, op=new, Time Int = 0.25, Time Marks =Yes
*Node output, Nset =QA_TEST
 u,
*Node output
 u,
*Element output, Elset =QA_Test
 s,
*Output, hist, filter=antialiasing, Time Int=0.1
*Element Output, Elset=QA_TEST
S, LE
*Node Output, Nset=QA_TEST
U,
*Energy output, VAR=PRESELECT
*end step
**
** --------------------------------------------------