*HEADING
 PRESSURIZED RUBBER DISC --- S4R ELEMENTS
*NODE,NSET=TOP
*NGEN,LINE=C,NSET=TOP
*NGEN,NSET=TOP
*ELEMENT,TYPE=S4R
*ELGEN,ELSET=SHEET
*ELEMENT,TYPE=S4R,ELSET=SHEET
*ELEMENT,TYPE=S4R
*ELGEN,ELSET=SHEET
*ELSET, ELSET=CAVSURF
*SURFACE, TYPE=ELEMENT, NAME=FLSURF
CAVSURF, SNEG
*NSET,NSET=XFIX,GEN
*NSET,NSET=YFIX,GEN
*NSET,NSET=HINGE,GEN
*NSET,NSET=DEF
*BOUNDARY
XFIX,XSYMM
YFIX,YSYMM
HINGE,1,3
*SHELL SECTION, SECTION INT=GAUSS,ELSET=SHEET,MATERIAL=A1,ORIENTATION=ORI
0.05,5
*ORIENTATION,NAME=ORI,SYSTEM=CYLINDRICAL
*MATERIAL,NAME=A1
*DENSITY
1.E-4,
*HYPERELASTIC,N=1
80.,20.,
*AMPLITUDE,NAME=RAMP
0.,0., .01,1.
*PHYSICAL CONSTANTS,ABSOLUTE ZERO=-273.16, UNIVERSAL GAS CONSTANT=73.562
*FLUID CAVITY, NAME=CHAMBER, REF NODE=999, BEHAVIOR=GAS, SURFACE=FLSURF, AMBIENT PRESSURE=14.7
*FLUID BEHAVIOR, NAME=GAS
*MOLECULAR WEIGHT
*CAPACITY, TYPE=TABULAR
**
*STEP
*DYNAMIC,EXPLICIT
,0.01
*BOUNDARY,AMP=RAMP
999,8,8,4.5
*MONITOR,NODE=1,DOF=3
*OUTPUT,FIELD,VAR=PRESELECT,NUM=5
**
** Output for qa testing
**
*NSET,NSET=QA_TEST
TOP,
*FILE OUTPUT,NUMBER INTERVAL=1
*NODE FILE
 U,
*OUTPUT,FIELD,NUMBER INTERVAL=1
*NODE OUTPUT,NSET=QA_TEST
 U,
*OUTPUT,HISTORY,VAR=PRESELECT,TIME INTERVAL=0.0025
**
*END STEP