*HEADING
 PRESSURIZED RUBBER DISC --- CAX4R ELEMENTS
*NODE,NSET=NOUT
*NODE,NSET=REF
*NGEN,LINE=P
*NSET,NSET=CENTER
*ELEMENT,TYPE=CAX4R,ELSET=ALL
*ELGEN,ELSET=ALL
*ELSET,ELSET=BOTTOM,GEN
*BOUNDARY
31,1,2
CENTER,XSYMM
*EQUATION
*SOLID SECTION,ELSET=ALL,MATERIAL=A1
*MATERIAL,NAME=A1
*DENSITY
1.E-4,
*HYPERELASTIC,N=1
80.,20.,
*ELSET, ELSET=CAVSURF, GENERATE
*SURFACE, TYPE=ELEMENT, NAME=FLSURF
CAVSURF, S1
*PHYSICAL CONSTANTS,ABSOLUTE ZERO=-273.16, UNIVERSAL GAS CONSTANT=73.562
*FLUID CAVITY, NAME=CHAMBER, REF NODE=999, BEHAVIOR=GAS, SURFACE=FLSURF, AMBIENT PRESSURE=14.7
*FLUID BEHAVIOR, NAME=GAS
*MOLECULAR WEIGHT
*CAPACITY, TYPE=TABULAR
*AMPLITUDE,NAME=RAMP
0.,0., .01,1.
**
*STEP
*DYNAMIC,EXPLICIT
,0.01
*BOUNDARY,AMP=RAMP
999,8,8,46.0
*MONITOR,NODE=21,DOF=2
*OUTPUT,FIELD,VAR=PRESELECT,NUM=5
**
** Output for qa testing
**
*NSET,NSET=QA_TEST
NOUT,
*FILE OUTPUT,NUMBER INTERVAL=1
*NODE FILE
 U,
*OUTPUT,FIELD,NUMBER INTERVAL=1
*NODE OUTPUT,NSET=QA_TEST
 U,
*OUTPUT,HISTORY,VAR=PRESELECT,TIME INTERVAL=0.0025
**
*END STEP