*HEADING
 PRESSURIZED RUBBER DISC --- CAX4R ELEMENTS
*NODE,NSET=NOUT
*NSET,NSET=MIDNODE
*NGEN,LINE=P, NSET=QA_TEST_ALLNODES
*NSET,NSET=CENTER
*ELEMENT,TYPE=CAX4R,ELSET=ALL
*ELGEN,ELSET=ALL
*ELSET,ELSET=BOTTOM,GEN
*BOUNDARY
31,1,2
CENTER,XSYMM
*EQUATION
*SOLID SECTION,ELSET=ALL,MATERIAL=A1
*MATERIAL,NAME=A1
*DENSITY
1.E-4,
*HYPERELASTIC,N=1
80.,20.,
*AMPLITUDE,NAME=RAMP
0.,0., .01,1.
**
**
*ELSET,ELSET=QA_TEST_ALLELEMS
ALL,
**
*NSET, NSET=QA_TEST_ALLNODES
NOUT, MIDNODE, QA_TEST_ALLNODES, CENTER
**
*STEP
*DYNAMIC,EXPLICIT
,0.01
*DLOAD,AMP=RAMP
BOTTOM,P1,46.
*MONITOR,NODE=21,DOF=2
**
*FILE OUTPUT,TIMEMARKS=YES,NUMBER INTERVAL=2
*EL FILE
 PRESS,
 MISES,
 LE,
*NODE FILE
 U,
**
*EXTREME VALUE,HALT=NO
*EXTREME ELEMENT VALUE,ELSET=BOTTOM,OUTPUT=YES,MIN
 NE22,-0.8
*EXTREME VALUE,HALT=YES
*EXTREME NODE VALUE,NSET=MIDNODE,MAX
 U2,15.25
**
*OUTPUT, FIELD, TIMEMARKS=YES, NUMBER INTERVAL=2
*ELEMENT OUTPUT, ELSET=QA_TEST_ALLELEMS
 PRESS,
 MISES,
 LE,
*NODE OUTPUT, NSET=QA_TEST_ALLNODES
 U,
*OUTPUT,FIELD,VARIABLE=PRESELECT
*OUTPUT,HISTORY,VARIABLE=PRESELECT,TIMEINT=0.005
***OUTPUT,HISTORY,VARIABLE=PRESELECT
*END STEP