*HEADING
ONE DIMENSIONAL COUPLED DEMAND WETTABILITY, WITH GEL, QUADRATIC ELEMENTS
*** UNITS: M, SEC, NEWTON
*NODE,NSET=ALLN
*NGEN,NSET=BOT
*NGEN,NSET=TOP
*NFILL,NSET=ALLN
BOT,TOP,20,5
*NSET,NSET=LHS,GENERATE
*NSET,NSET=RHS,GENERATE
*NSET,NSET=PORN,GENERATE
*ELEMENT,TYPE=CPE8RP,ELSET=BLOCK
*ELGEN,ELSET=BLOCK
*ELSET,ELSET=OUTE
*******************************************
*SOLID SECTION,ELSET=BLOCK,MATERIAL=CORE
.02,
*MATERIAL,NAME=CORE
*ELASTIC
10000.,0.
*POROUS BULK MODULI
*PERMEABILITY,SPECIFIC=10000.
3.7E-4,
*SORPTION
*SORPTION,TYPE=EXSORPTION
*GEL
*******************************************
*INITIAL CONDITIONS,TYPE=SATURATION
ALLN,.05
*INITIAL CONDITIONS,TYPE=PORE PRESSURE
PORN,-10000.
*INITIAL CONDITIONS,TYPE=RATIO
ALLN,5.
*BOUNDARY
BOT,2
ALLN,1
*RESTART,WRITE,FREQUENCY=10
*******************************************
*STEP
*SOILS,CONSOLIDATION
*DLOAD
10,P3,-500.
*CONTROLS,ANALYSIS=DISCONTINUOUS
*OUTPUT,FIELD
*NODE OUTPUT,NSET=ALLN
 U,POR
*ELEMENT OUTPUT,ELSET=BLOCK
 S,SAT,VOIDR,GELVR,POR
*OUTPUT,HISTORY
*NODE OUTPUT,NSET=LHS
 U,RF,POR,RVT
*ELEMENT OUTPUT,ELSET=OUTE
 S22,POR,GELVR,SAT,VOIDR
*END STEP
*******************************************
*STEP,INC=100,NLGEOM
*SOILS,CONSOLIDATION,UTOL=10000.
*BOUNDARY
1,8,,-100.
3,8,,-100.
*END STEP