*HEADING
ONE DIMENSIONAL COUPLED DEMAND WETTABILITY, WITH GEL, AXISYMMETRIC LINEAR ELEMENTS
*** UNITS: M, SEC, NEWTON
*NODE,NSET=ALLN
*NGEN,NSET=BOT
*NGEN,NSET=TOP
*NFILL,NSET=ALLN
BOT,TOP,20,5
*NSET,NSET=LHS,GENERATE
*NSET,NSET=RHS,GENERATE
*ELEMENT,TYPE=CAX4P,ELSET=BLOCK
*ELGEN,ELSET=BLOCK
*ELSET,ELSET=OUTE
*NSET,NSET=PORN,GENERATE
************************************************
*SOLID SECTION,ELSET=BLOCK,MATERIAL=CORE
*MATERIAL,NAME=CORE
*ELASTIC
10000.,0.
*POROUS BULK MODULI
*PERMEABILITY,SPECIFIC=10000.
3.7E-4,
*SORPTION
*SORPTION,TYPE=EXSORPTION
*GEL
*amplitude, name=smooth, definition=smooth step
 0.,0., 100., 1.
************************************************
*INITIAL CONDITIONS,TYPE=SATURATION
ALLN,.05
*INITIAL CONDITIONS,TYPE=PORE PRESSURE
PORN,-10000.
*INITIAL CONDITIONS,TYPE=RATIO
ALLN,5.
*BOUNDARY
BOT,2
ALLN,1
*RESTART,WRITE,FREQUENCY=10
************************************************
**
*STEP
*SOILS,CONSOLIDATION
*DLOAD
10,P3,-500.
*CONTROLS,ANALYSIS=DISCONTINUOUS
*NODE PRINT,FREQUENCY=5,NSET=LHS
U,RF,POR,RVT
*EL PRINT,FREQUENCY=5,ELSET=OUTE
S,E
SAT,POR,GELVR,VOIDR
*NODE FILE,FREQUENCY=1,NSET=LHS
U,RF,POR,RVT
*EL FILE,FREQUENCY=1,ELSET=OUTE
S,E
SAT,POR,GELVR,VOIDR
*OUTPUT,FIELD, Frequency=100
*NODE OUTPUT,NSET=LHS
 U,POR
*ELEMENT OUTPUT,ELSET=OUTE
 S,SAT,VOIDR
*OUTPUT,HISTORY,Frequency=5
*NODE OUTPUT,NSET=LHS
 U,RF,POR,RVT
*ELEMENT OUTPUT,ELSET=OUTE
 S22,POR,GELVR
*END STEP
************************************************
*STEP,INC=100,NLGEOM
*SOILS,CONSOLIDATION,UTOL=10000.
*BOUNDARY, amplitude=smooth
1,8,,-100.
3,8,,-100.
*END STEP