*HEADING
 ductile criterion with eos/johnson-cook plasticity
*RESTART,WRITE,NUMBER INTERVAL=10
*PREPRINT,MODEL=YES
*NODE,NSET=NALL
******3D SOLID CONTINUUM AND CONTINUUM SHELL************
*ELEMENT,TYPE=C3D8R,ELSET=SOLID3D
*NSET,NSET=SOLID_BOTTOM
*NSET,NSET=SOLID_TOP
*NSET,NSET=SOLID_LEFT
*NSET,NSET=SOLID_RIGHT
*NSET,NSET=SOLID_FRONT
*NSET,NSET=SOLID_BACK
*NSET,NSET=SOLID_ALL
SOLID_BOTTOM,SOLID_TOP,SOLID_LEFT,SOLID_RIGHT,SOLID_FRONT,SOLID_BACK
*****PLANE STRAIN,AXIAL SYMMETRIC****
*ELEMENT,TYPE=CPE4R,ELSET=SOLID2D
*ELEMENT,TYPE=CAX4R,ELSET=SOLID3D
*NSET,NSET=PLANE_BOTTOM
*NSET,NSET=PLANE_TOP
*NSET,NSET=PLANE_LEFT
*NSET,NSET=PLANE_RIGHT
*NSET,NSET=PLANE_ALL
PLANE_BOTTOM,PLANE_TOP,PLANE_LEFT,PLANE_RIGHT,
*ELSET,ELSET=SOLID
SOLID2D,SOLID3D
*ELSET,ELSET=EALL
SOLID
*ELSET,ELSET=QA_TEST_ALLELEMENTS
EALL
**************************************
*BOUNDARY
SOLID_BOTTOM,2,2
SOLID_LEFT,1,1
SOLID_ALL,3,3
PLANE_BOTTOM,2,2
PLANE_LEFT,1,1
PLANE_ALL,3,3
***************************************
*SOLID SECTION,MATERIAL=MAT_EOS,ELSET=SOLID2D,CONTROLS=CONT
1.0
*SOLID SECTION,MATERIAL=MAT_EOS,ELSET=SOLID3D,CONTROLS=CONT
1.0
*SECTION CONTROLS,ELEMENT DELETION=YES,MAX DEGRADATION=0.75,NAME=CONT
***************************************
*MATERIAL,NAME=MAT_EOS
*EOS,TYPE=USUP
*ELASTIC, TYPE=SHEAR
 80.232558E9,
*PLASTIC,HARDENING=JOHNSON COOK
 175.E6, 380.E6, 0.32, 0.55, 1538., 25.
*DENSITY
 7.890E3,
*DAMAGE INITIATION,CRITERION=DUCTILE
3E-2
*DAMAGE EVOLUTION,TYPE=DISPLACEMENT,SOFTENING=LINEAR
3E-2
*AMPLITUDE,NAME=AMP1,DEFINITION=DECAY
-1,1,0,-5
*STEP
*DYNAMIC,EXPLICIT
,0.5
*BOUNDARY,TYPE=DISPLACEMENT,AMP=AMP1
SOLID_TOP,2,2,1
SOLID_RIGHT,1,1,1
PLANE_TOP,2,2,1
PLANE_RIGHT,1,1,1
**
**
*OUTPUT,FIELD,NUMBER INTERVAL=20,TIME MARKS=YES
*ELEMENT OUTPUT,ELSET=QA_TEST_ALLELEMENTS
STATUS,SDEG,DMICRT
PEEQ,S
*NODE OUTPUT,NSET=NALL
U,
*OUTPUT,HISTORY,TIME INTERVAL=0.001
*ELEMENT OUTPUT,ELSET=EALL
STATUS,SDEG,DMICRT
PEEQ,LEP,SP,MISES,PRESS,TRIAX
*OUTPUT,HISTORY,VARIABLE=PRESELECT,TIME INTERVAL=0.25
*END STEP