*HEADING
 THICK CYLINDER - PLANE STRAIN ( 5-DEGREE SECTOR )
*NODE
*NGEN
*NGEN,NSET=SIDE1
*NGEN,NSET=SIDE2
*NSET,NSET=SIDES
SIDE1,SIDE2
*NSET,NSET=BORE
*TRANSFORM,NSET=SIDE1
*TRANSFORM,NSET=SIDE2
*ELEMENT,TYPE=CPE8H
*ELGEN,ELSET=EALL
*ELSET,ELSET=MID
*SOLID SECTION,MATERIAL=A1,ELSET=EALL
*MATERIAL,NAME=A1
*ELASTIC
30.E6,.3
*PLASTIC
30.E3,
*STEP,NLGEOM,INC=50
*STATIC
0.1 , 1.0
*BOUNDARY
BORE,1,1,20.
SIDES,2
*PRINT,RESIDUAL=NO
*NODE PRINT
U,RF
*EL PRINT,ELSET=MID,POSITION=CENTROIDAL,SUMMARY=NO
S,MISES,E
*EL FILE,ELSET=MID,POSITION=CENTROIDAL
S,
*NODE FILE,NSET=BORE
U,
RF,
*END STEP