*HEADING
AXISYMMETRIC UPSETTING PROBLEM -- SLOW CASE,  CAX4RT ELEMENTS
--COUPLED TEMPERATURE DISPLACEMENT ANALYSIS
--SLOW UPSETTING
--LINEAR DISPLACEMENT ELEMENTS (NO REZONING)
*RESTART,WRITE,FREQUENCY=5
*NODE,NSET=RSNODE
*NODE
*NGEN,NSET=MIDDLE
*NGEN,NSET=TOP
*NSET,NSET=TOPBND,GENERATE
*NFILL
MIDDLE,TOP,12,100
*NSET,NSET=AXIS,GENERATE
*ELEMENT,TYPE=CAX4RT,ELSET=METAL
*ELGEN,ELSET=METAL
*ELSET,ELSET=ESID,GENERATE
*ELSET,ELSET=ETOP,GENERATE
*rigid body,analytical surface=BSURF,REFNODE=9999
*surface,TYPE=SEGMENTS,NAME=BSURF
START,.020,.015
LINE,-.001,.015
*surface,NAME=ASURF
ESID,S2
ETOP,S3
*CONTACT PAIR,INTERACTION=ROUGH
ASURF,BSURF
*SURFACE INTERACTION,NAME=ROUGH
*SURFACE BEHAVIOR,NO SEPARATION
*FRICTION,ROUGH
*SOLID SECTION,ELSET=METAL,MATERIAL=EL
*MATERIAL,NAME=EL
*ELASTIC
200.E9,.3
*PLASTIC
7.E8,0.00
3.7E9,10.0
*RATE DEPENDENT
*SPECIFIC HEAT
586.,
*DENSITY
7833.,
*CONDUCTIVITY
52.,
*EXPANSION
1.2E-5,
*INELASTIC HEAT FRACTION
*BOUNDARY
MIDDLE,2
AXIS,1
*STEP,INC=50,AMPLITUDE=RAMP,NLGEOM,UNSYMM=YES
*COUPLED TEMPERATURE-DISPLACEMENT,DELTMX=100.
1.5,100.,5.E-8,5.
*PRINT,CONTACT=YES
*MONITOR,NODE=9999,DOF=2
*BOUNDARY
RSNODE,1
RSNODE,6
RSNODE,2,,-.009
*CONTACT PRINT,SLAVE=ASURF,FREQUENCY=40
*CONTACT FILE,SLAVE=ASURF,FREQUENCY=40
*OUTPUT,FIELD,FREQ=40
*CONTACT OUTPUT,VARIABLE=PRESELECT,SLAVE=ASURF
*EL PRINT, ELSET=METAL,FREQUENCY=40
S,MISES
E,PEEQ
*NODE PRINT, FREQUENCY=10
U,RF,NT,RFL
*NODE FILE,NSET=RSNODE
RF,
*OUTPUT,FIELD
*NODE OUTPUT,NSET=RSNODE
RF,
*NODE FILE, FREQUENCY=50
NT,
*OUTPUT,FIELD,FREQ=50
*NODE OUTPUT
U,NT,
*ELEMENT OUTPUT
PE,TEMP
*END STEP