*HEADING
 HYDROSTATIC COMPRESSION TEST, 3D, DYTHERM 2.5,**FOAM MODEL
 WITH VOLUMETRIC HARDENING (C3D8I)
**
*NODE,NSET=FACE1
*NODE,NSET=FACE2
*NSET,NSET=FACE3
*NSET,NSET=FACE4
*NSET,NSET=FACE5
*NSET,NSET=FACE6
*NSET,NSET=OUT
*ELEMENT,TYPE=C3D8I,ELSET=FOAM
*SOLID SECTION,ELSET=FOAM,MATERIAL=FOAM
*MATERIAL,NAME=FOAM
*ELASTIC
 3.E6, 0.2
*CRUSHABLE FOAM,HARDENING=VOLUMETRIC
*CRUSHABLE FOAM HARDENING
*DENSITY
 500.,
**
*AMPLITUDE,TIME=TOTAL TIME,NAME=AMP,DEFINITION=SMOOTH STEP
 0., 0., 10., 0.6
*BOUNDARY
 FACE1, 3
 FACE3, 2
 FACE6, 1
**
*STEP
*DYNAMIC,EXPLICIT
 ,10.
*BOUNDARY,TYPE=DISP,AMP=AMP
 FACE4, 1, 1, -1.
 FACE5, 2, 2, -1.
 FACE2, 3, 3, -1.
**
*OUTPUT,FIELD,NUMBER INTERVAL=1
*ELEMENT OUTPUT
 MISES,
 PRESS,
 PEEQ,
*NODE OUTPUT
 U,
 RF,
**
*OUTPUT,HISTORY,FRE=1
*ELEMENT OUTPUT,ELSET=FOAM
 MISES,
 PRESS,
 PEEQ,
 LE,
*NODE OUTPUT,NSET=OUT
 U,
 RF,
**
** Output requests for qa testing
**
*NSET,NSET=QA_TEST,ELSET=FOAM
*ELSET,ELSET=QA_TEST
FOAM,
*OUTPUT,FIELD,NUM=1
*NODE OUTPUT,NSET=QA_TEST
U,
*ELEMENT OUTPUT,ELSET=QA_TEST
PEEQ,
*OUTPUT,HISTORY,VAR=PRESELECT,TIME INTERVAL=2.5
*FILE OUTPUT,NUMBER INTERVAL=1
*EL FILE
 PEEQ,
*NODE FILE
 U,
*END STEP