*HEADING
 UNIAXIAL TENSION TEST, 3D, DYTHERM 2.5,**FOAM MODEL
*NODE,NSET=FACE1
*NODE,NSET=FACE2
*NSET,NSET=FACE3
*NSET,NSET=FACE4
*NSET,NSET=FACE5
*NSET,NSET=FACE6
*NSET,NSET=OUT
*ELEMENT,TYPE=C3D8,ELSET=FOAM
*SOLID SECTION,ELSET=FOAM,MATERIAL=FOAM
*MATERIAL,NAME=FOAM
*ELASTIC
 3.E6, 0.0
*CRUSHABLE FOAM
*CRUSHABLE FOAM HARDENING
**
*BOUNDARY
 FACE1, 3
 FACE3, 2
 FACE6, 1
**
*STEP,INC=20,NLGEOM,UNSYMM=YES
*STATIC,DIRECT
 1., 20.
*BOUNDARY
 FACE2, 3, 3, 0.3
**
*EL PRINT
 S,
 LE,
 PE,
*NODE PRINT
 U,
 RF,
*EL FILE
 S,
 LE,
 PE,
*NODE FILE
 U,
 RF,
**
*OUTPUT,HISTORY,FRE=1
*ELEMENT OUTPUT,ELSET=FOAM
 MISES,
 PRESS,
 PEEQ,
 LE33,
*NODE OUTPUT,NSET=OUT
 U3,
 RF3,
**
*END STEP