*HEADING
 TRUE SHEAR TEST, 3D, DYTHERM 2.5,**FOAM MODEL
*NODE,NSET=FACE1
*NODE,NSET=FACE2
*NSET,NSET=FACE3
*NSET,NSET=FACE4
*NSET,NSET=FACE5
*NSET,NSET=FACE6
*NSET,NSET=OUT
*ELEMENT,TYPE=C3D8,ELSET=FOAM
*SOLID SECTION,ELSET=FOAM,MATERIAL=FOAM
*MATERIAL,NAME=FOAM
*ELASTIC
 3.E6, 0.2
*CRUSHABLE FOAM
*CRUSHABLE FOAM HARDENING
**
*BOUNDARY
 FACE1, 1, 3
 FACE2, 1
 FACE2, 3
**
*STEP,INC=20,NLGEOM,UNSYMM=YES
*STATIC,DIRECT
 1., 20.
*BOUNDARY
 FACE2, 2, 2, 0.5
**
*EL PRINT
 S,
 LE,
 PE,
*NODE PRINT
 U,
 RF,
*EL FILE
 S,
 LE,
 PE,
*NODE FILE
 U,
 RF,
**
*OUTPUT,HISTORY,FRE=1
*ELEMENT OUTPUT,ELSET=FOAM
 MISES,
 PRESS,
 PEEQ,
 LE,
*NODE OUTPUT,NSET=OUT
 U,
 RF,
**
*END STEP