*HEADING
BASIC VERIFICATION OF MISES CREEP AND PLASTICITY INTEGRATION
*NODE,NSET=ALLN
*ELEMENT,TYPE=CPS4,ELSET=ALLE
*SOLID SECTION,ELSET=ALLE,MATERIAL=ALLE
*MATERIAL,NAME=ALLE
*ELASTIC
 20.0E6,0.3
** Include hardening data *PLASTIC
*INCLUDE,INPUT=creep_misescurve.inp
*CREEP, LAW=TIME
 2.5e-23,5,-0.2
*BOUNDARY
 1,PINNED
 2,2
 4,1
*AMPLITUDE, NAME=RAMP
 0.0,0.0,50.0,0.5,100.0,1.0
**
*STEP, INC=200
*VISCO, CETOL=1.0e-4
 0.01,100.
*DLOAD, AMP=RAMP
 1,P3,-20000.
*EL FILE,freq=1
 PE,CE,E,EE,
*OUTPUT,FIELD,VARIABLE=PRESELECT,FREQUENCY=9999
*OUTPUT,HISTORY,Frequency=1
*ELEMENT OUTPUT, ELSET=ALLE
 PE,CE,CEEQ,E,EE,
*CONTROLS,PARAMETERS=FIELD
,0.0,
*END STEP