*Heading
 Model dynamic crack propagation in a three point bending specimen
 using xfem c3d8r elements
*Preprint, echo=NO, model=NO, history=NO, contact=NO
*Node
*Element, type=C3D8R
*Nset, nset=_PickedSet2, generate
*Elset, elset=_PickedSet2, generate
** Section: Section-1
*Solid Section, elset=_PickedSet2, material=Material-1
*enrichment,elset=_PickedSet2,interaction=lower,type=propagation crack,name=abc
**
*Nset, nset=_PickedSet13
*Elset, elset=_PickedSet13
*Nset, nset=_PickedSet14
*Elset, elset=_PickedSet14
*Nset, nset=_PickedSet15
*Nset, nset=_PickedSet16
*Elset, elset=_PickedSet16
**
** MATERIALS
**
*Material, name=Material-1
*Elastic
 3.137e+10, 0.2
*Density
2400.,
*Damage Initiation, criterion=MAXPS
 1.045e+07,
*Damage Evolution, type=ENERGY,mixed mode behavior=power law,power=1.0
19.58,19.58,19.58
*surface interaction,name=lower
*initial condition,type=enrichment
 12876, 1,abc,   0.0010160,   0.0000000
 12876, 2,abc,   0.0010160,  -0.0027143
 12876, 3,abc,  -0.0015240,  -0.0027143
 12876, 4,abc,  -0.0015240,   0.0000000
 12876, 5,abc,   0.0010160,   0.0000000
 12876, 6,abc,   0.0010160,  -0.0027143
 12876, 7,abc,  -0.0015240,  -0.0027143
 12876, 8,abc,  -0.0015240,   0.0000000
 12877, 1,abc,   0.0010160,  -0.0027143
 12877, 2,abc,   0.0010160,  -0.0054286
 12877, 3,abc,  -0.0015240,  -0.0054286
 12877, 4,abc,  -0.0015240,  -0.0027143
 12877, 5,abc,   0.0010160,  -0.0027143
 12877, 6,abc,   0.0010160,  -0.0054286
 12877, 7,abc,  -0.0015240,  -0.0054286
 12877, 8,abc,  -0.0015240,  -0.0027143
 12878, 1,abc,   0.0010160,  -0.0054286
 12878, 2,abc,   0.0010160,  -0.0081429
 12878, 3,abc,  -0.0015240,  -0.0081429
 12878, 4,abc,  -0.0015240,  -0.0054286
** ... 540 like lines cut
**
** BOUNDARY CONDITIONS
**
** Name: BC-1 Type: Displacement/Rotation
*Boundary
_PickedSet13, 1, 1
_PickedSet13, 2, 2
** Name: BC-2 Type: Displacement/Rotation
*Boundary
_PickedSet14, 2, 2
** Name: BC-3 Type: Displacement/Rotation
*Boundary
_PickedSet15, 3, 3
**
*AMPLITUDE,NAME=RAMP
0.0,0.0,1.96e-4,1.0,1.5e-3,1.0
** ----------------------------------------------------------------
**
** STEP: Step-1
**
*Step, name=Step-1, nlgeom=YES, inc=10000
*Dynamic,haftol=500
5e-07,1.2e-3,1.5e-15,5.e-6
**For real run, use the following
**5e-07,1.3e-3,1.5e-15,5.e-6
**
*CONTROLS,PARAMETERS=TIME INCREMENTATION
 , , , , , , ,10
*controls,analysis=discont
**
** BOUNDARY CONDITIONS
**
** Name: BC-4 Type: Velocity/Angular velocity
*Boundary, type=VELOCITY, amplitude=RAMP
_PickedSet16, 2, 2, -0.06
**
**
** OUTPUT REQUESTS
**
**Restart, write, frequency=0
**
** FIELD OUTPUT: F-Output-1
**
*Output, field,FREQ=10
*element output
S,statusxfem
*node output
u,philsm
**
** HISTORY OUTPUT: H-Output-1
**
*Output, history
*node output,nset=_PickedSet16
rf2,u2
*End Step