*Heading
 Model dynamic crack propagation in a three point bending specimen
 using xfem c3d4 elements
*Preprint, echo=NO, model=NO, history=NO, contact=NO
*Node
*Element, type=C3D4
*Nset, nset=_PickedSet2, generate
*Elset, elset=_PickedSet2, generate
** Section: Section-1
*Solid Section, elset=_PickedSet2, material=Material-1
*enrichment,elset=_PickedSet2,interaction=lower,type=propagation crack,name=abc
**
*Nset, nset=_PickedSet13
*Elset, elset=_PickedSet13
*Nset, nset=_PickedSet14
*Elset, elset=_PickedSet14
*Nset, nset=_PickedSet15
*Nset, nset=_PickedSet16
*Elset, elset=_PickedSet16
**
** MATERIALS
**
*Material, name=Material-1
*Elastic
 3.137e+10, 0.2
*Density
2400.,
*Damage Initiation, criterion=MAXPS
1.045e+07,
*Damage Evolution, type=ENERGY,mixed mode behavior=power law, power=1.0
19.58,19.58,19.58
**
*surface interaction,name=lower
*initial condition,type=enrichment
 83204, 1,abc,   0.0018512,  -0.0100432
 83204, 2,abc,  -0.0016583,  -0.0102862
 83204, 3,abc,  -0.0014397,  -0.0132131
 83204, 4,abc,   0.0015956,  -0.0134761
 83288, 1,abc,   0.0043328,  -0.0103783
 83288, 2,abc,   0.0009210,  -0.0093186
 83288, 3,abc,  -0.0000028,  -0.0114046
 83288, 4,abc,   0.0036542,  -0.0108503
 83295, 1,abc,   0.0023893,  -0.0109815
 83295, 2,abc,   0.0005383,  -0.0082778
 83295, 3,abc,   0.0018512,  -0.0100432
 83295, 4,abc,  -0.0016583,  -0.0102862
 83297, 1,abc,  -0.0018322,  -0.0107582
 83297, 2,abc,   0.0018512,  -0.0100432
 83297, 3,abc,  -0.0010157,  -0.0080397
 83297, 4,abc,   0.0005383,  -0.0082778
 83298, 1,abc,  -0.0010157,  -0.0080397
 83298, 2,abc,   0.0018512,  -0.0100432
 83298, 3,abc,   0.0014821,  -0.0080263
 83298, 4,abc,   0.0005383,  -0.0082778
** ... 1852 like lines cut
 *****, 1,abc,  -0.0005463,  -0.0017249
 *****, 2,abc,   0.0010160,   0.0000000
 *****, 3,abc,   0.0019147,  -0.0017521
 *****, 4,abc,   0.0010160,   0.0000000
 *****, 1,abc,  -0.0005463,  -0.0017249
 *****, 2,abc,   0.0010160,   0.0000000
 *****, 3,abc,  -0.0006424,  -0.0018505
 *****, 4,abc,  -0.0015240,   0.0000000
 *****, 1,abc,  -0.0005463,  -0.0017249
 *****, 2,abc,   0.0004501,  -0.0042935
 *****, 3,abc,  -0.0022619,  -0.0040747
 *****, 4,abc,  -0.0006424,  -0.0018505
 *****, 1,abc,  -0.0003548,  -0.0049298
 *****, 2,abc,  -0.0014718,  -0.0038407
 *****, 3,abc,  -0.0006333,  -0.0018494
 *****, 4,abc,   0.0021420,  -0.0042374
 *****, 1,abc,  -0.0009792,  -0.0045795
 *****, 2,abc,  -0.0016620,  -0.0067365
 *****, 3,abc,  -0.0029809,  -0.0080864
 *****, 4,abc,   0.0008484,  -0.0067247
** ... 204 like lines cut
**
** BOUNDARY CONDITIONS
**
** Name: BC-1 Type: Displacement/Rotation
*Boundary
_PickedSet13, 1, 1
_PickedSet13, 2, 2
** Name: BC-2 Type: Displacement/Rotation
*Boundary
_PickedSet14, 2, 2
** Name: BC-3 Type: Displacement/Rotation
*Boundary
_PickedSet15, 3, 3
**
*AMPLITUDE,NAME=RAMP
0.0,0.0,1.96e-4,1.0,1.5e-3,1.0
** ----------------------------------------------------------------
**
** STEP: Step-1
**
*Step, name=Step-1, nlgeom=YES, inc=10000
*Dynamic,haftol=500
5e-07,8.1e-4,1.5e-15,5.e-6
** Use the following as real run
**5e-07,8.6e-4,1.5e-15,5.e-6
**
*CONTROLS,PARAMETERS=TIME INCREMENTATION
 , , , , , , ,10
*controls,analysis=discont
**
** BOUNDARY CONDITIONS
**
** Name: BC-4 Type: Velocity/Angular velocity
*Boundary, type=VELOCITY, amplitude=RAMP
_PickedSet16, 2, 2, -0.06
**
** OUTPUT REQUESTS
**
**Restart, write, frequency=0
**
** FIELD OUTPUT: F-Output-1
**
*Output, field,FREQ=10
*element output
S,statusxfem
*node output
u,philsm
**
** HISTORY OUTPUT: H-Output-1
**
*Output, history
*node output,nset=_PickedSet16
rf2,u2
*End Step