*Heading
 Model dynamic crack propagation in a three point bending specimen
 using xfem elements
*Preprint, echo=NO, model=NO, history=NO, contact=NO
**
*Node
*Element, type=CPE4R
*Nset, nset=_PickedSet2, generate
*Elset, elset=_PickedSet2, generate
** Section: Section-1
*Solid Section, elset=_PickedSet2, material=Material-1
0.0254
*enrichment,elset=_PickedSet2,interaction=lower,type=propagation crack,name=abc
**
*Nset, nset=_PickedSet13
*Nset, nset=_PickedSet14
*Nset, nset=_PickedSet15
**
** MATERIALS
**
*Material, name=Material-1
*Elastic
 3.137e+10, 0.2
*density
2400.0
*Damage Initiation, criterion=MAXPS,position=nonlocal
 1.045e+7
*Damage Evolution, type=ENERGY,mixed mode behavior=power law,power=1.0
19.58,19.58
*damage stabilization
*surface interaction,name=lower
*initial condition,type=enrichment
  1193, 1,abc,   0.0005080,   0.0000000
  1193, 2,abc,  -0.0010795,   0.0000000
  1193, 3,abc,  -0.0010795,  -0.0015833
  1193, 4,abc,   0.0005080,  -0.0015833
  1257, 1,abc,   0.0005080,  -0.0015833
  1257, 2,abc,  -0.0010795,  -0.0015833
  1257, 3,abc,  -0.0010795,  -0.0031667
  1257, 4,abc,   0.0005080,  -0.0031667
  1321, 1,abc,   0.0005080,  -0.0031667
  1321, 2,abc,  -0.0010795,  -0.0031667
  1321, 3,abc,  -0.0010795,  -0.0047500
  1321, 4,abc,   0.0005080,  -0.0047500
  1385, 1,abc,   0.0005080,  -0.0047500
  1385, 2,abc,  -0.0010795,  -0.0047500
  1385, 3,abc,  -0.0010795,  -0.0063333
  1385, 4,abc,   0.0005080,  -0.0063333
  1449, 1,abc,   0.0005080,  -0.0063333
  1449, 2,abc,  -0.0010795,  -0.0063333
  1449, 3,abc,  -0.0010795,  -0.0079167
  1449, 4,abc,   0.0005080,  -0.0079167
** ... 28 like lines cut
**
** BOUNDARY CONDITIONS
**
** Name: BC-1 Type: Displacement/Rotation
*Boundary
_PickedSet13, 2, 2
** Name: BC-2 Type: Displacement/Rotation
*Boundary
_PickedSet14, 1, 1
_PickedSet14, 2, 2
** ----------------------------------------------------------------
**
*AMPLITUDE,NAME=RAMP
0.0,0.0,1.96e-4,1.0,1.5e-3,1.0
**
** STEP: Step-1
**
*Step, name=Step-1, inc=1000,nlgeom
*DYNAMIC,HAFTOL=600.0
5.e-7,1.32e-3,1.0e-12,5.e-6
**
*CONTROLS,PARAMETERS=TIME INCREMENTATION
 , , , , , , ,10
**
** BOUNDARY CONDITIONS
**
**
*Boundary,type=velocity,amplitude=RAMP
_PickedSet15, 2, 2,-0.060
**
** OUTPUT REQUESTS
**
**Restart, write, frequency=0
**
** FIELD OUTPUT: F-Output-1
**
*Output, field,FREQ=10
*element output
S,statusxfem
*node output
u,philsm
**
** HISTORY OUTPUT: H-Output-1
**
**Output, history
**node output,nset=_PickedSet13
**rf2,u2
**Output, history
**node output,nset=_PickedSet14
**rf2,u2
*Output, history
*node output,nset=_PickedSet15
rf2,u2
*End Step