*Heading
** Job name: shear-3d-15um-c3d8r-t1 Model name: shear-3d-p1
** Generated by: Abaqus/CAE 6.10-DEV
*Preprint, echo=NO, model=NO, history=NO, contact=NO
**
** PARTS
**
*Part, name=Part-1
*End Part
**
*Part, name=Part-2
*End Part
**
**
** ASSEMBLY
**
*Assembly, name=Assembly
**
*Instance, name=Part-1-1, part=Part-1
*Node
*Element, type=C3D8R
*Nset, nset=_PickedSet2, internal, generate
*Elset, elset=_PickedSet2, internal, generate
** Section: Section-1
*Solid Section, elset=_PickedSet2, material=Material-1
*End Instance
**
*Instance, name=Part-2-1, part=Part-2
*End Instance
**
*Nset, nset=_PickedSet21, internal, instance=Part-1-1, generate
*Elset, elset=_PickedSet21, internal, instance=Part-1-1, generate
*Nset, nset=_PickedSet23, internal, instance=Part-1-1
*Elset, elset=_PickedSet23, internal, instance=Part-1-1
*Nset, nset=_PickedSet24, internal, instance=Part-1-1
*Elset, elset=_PickedSet24, internal, instance=Part-1-1, generate
*Nset, nset=_PickedSet29, internal, instance=Part-1-1
*Elset, elset=_PickedSet29, internal, instance=Part-1-1
*Nset, nset=Set-1, instance=Part-1-1
*Enrichment, name=Crack-1, type=PROPAGATION CRACK, elset=_PickedSet21, interaction=IntProp-1
*End Assembly
*Amplitude, name=Amp-1
          0.,           0.,        1e-07,           1.,        6e-06,           1.
**
** MATERIALS
**
*Material, name=Material-1
*Damage Initiation, criterion=MAXPS
100.,
*Damage Evolution, type=energy,mixed mode behavior=power law,power=1.0
0.7,0.7,0.7
*damage stabilization
*Density
 1.19e-09,
*Elastic
3240., 0.35
**
** INTERACTION PROPERTIES
**
*Surface Interaction, name=IntProp-1
1.,
*Initial Conditions, type=ENRICHMENT
Part-1-1.449, 1, Crack-1, 0.00666667, 0.00666666
Part-1-1.449, 2, Crack-1, 0.00666667, 0.00666666
Part-1-1.449, 3, Crack-1, 0.00666667, -0.00666666
Part-1-1.449, 4, Crack-1, 0.00666667, -0.00666666
Part-1-1.449, 5, Crack-1, -0.00666667, 0.00666666
Part-1-1.449, 6, Crack-1, -0.00666667, 0.00666666
Part-1-1.449, 7, Crack-1, -0.00666667, -0.00666666
Part-1-1.449, 8, Crack-1, -0.00666667, -0.00666666
Part-1-1.450, 1, Crack-1, 0.00666667, 0.00666666
Part-1-1.450, 2, Crack-1, 0.00666667, 0.00666666
Part-1-1.450, 3, Crack-1, 0.00666667, -0.00666666
Part-1-1.450, 4, Crack-1, 0.00666667, -0.00666666
Part-1-1.450, 5, Crack-1, -0.00666667, 0.00666666
Part-1-1.450, 6, Crack-1, -0.00666667, 0.00666666
Part-1-1.450, 7, Crack-1, -0.00666667, -0.00666666
Part-1-1.450, 8, Crack-1, -0.00666667, -0.00666666
Part-1-1.451, 1, Crack-1, 0.00666667, 0.00666666
Part-1-1.451, 2, Crack-1, 0.00666667, 0.00666666
Part-1-1.451, 3, Crack-1, 0.00666667, -0.00666666
Part-1-1.451, 4, Crack-1, 0.00666667, -0.00666666
** ... 876 like lines cut
** ----------------------------------------------------------------
**
** STEP: Step-1
**
*Step, name=Step-1, inc=10000,nlgeom
*Dynamic,haftol=500.
1e-09,6e-06,6e-11,5e-09
**
** BOUNDARY CONDITIONS
**
** Name: BC-1 Type: Symmetry/Antisymmetry/Encastre
*Boundary
_PickedSet23, ENCASTRE
** Name: BC-2 Type: Velocity/Angular velocity
*Boundary, type=VELOCITY,amp=Amp-1
_PickedSet24, 1, 1, 25000.
** Name: BC-3 Type: Velocity/Angular velocity
*Boundary, type=VELOCITY,amp=Amp-1
Set-1, 1, 1, 25000.
** Name: BC-4 Type: Symmetry/Antisymmetry/Encastre
*Boundary
_PickedSet29, ZSYMM
**
** OUTPUT REQUESTS
**
**
** FIELD OUTPUT: F-Output-2
**
*Output, field,freq=10
*Node Output
U,PHILSM
*element output
s,e,statusxfem
*End Step