*Heading
     3D Model mode I crack propagation with XFEM
** Generated by: Abaqus/CAE 6.9-EFR
*Preprint, echo=NO, model=yes, history=yes
**
*Node
*Element, type=C3D4
*Nset, nset=_PickedSet2, generate
*Elset, elset=_PickedSet2, generate
** Section: Section-1
*Solid Section, elset=_PickedSet2, material=Material-1
*enrichment,elset=_PickedSet2,interaction=lower,type=propagation crack, name=abc
**
*Nset, nset=_PickedSet10
*Nset, nset=_PickedSet11
*Nset, nset=_PickedSet12
*Elset, elset=_PickedSet12
*Nset, nset=_PickedSet13
*Elset, elset=_PickedSet13
**
** MATERIALS
**
*Material, name=Material-1
*Elastic
 2.1e+11, 0.3
*DAMAGE INITIATION,CRITERION=QUADS,normal direction=2,tolerance=0.1,unstable growth tolerance
2.2E8,2.2E8
*DAMAGE EVOLUTION,TYPE=ENERGY,MIXED MODE BEHAVIOR=POWER LAW,POWER=1.0
4.22d4,4.22d4,4.22d4
*DAMAGE STABILIZATION
*surface,type=xfem,name=efgh
abc
*surface interaction,name=lower
*initial condition,type=enrichment
  3852, 1,abc,   0.0269530,  -0.0734955
  3852, 2,abc,  -0.0279071,  -0.0623092
  3852, 3,abc,   0.0383859,  -0.0339060
  3852, 4,abc,  -0.0610000,   0.0000000
  3853, 1,abc,  -0.0449184,  -0.1040258
  3853, 2,abc,   0.0098925,  -0.1398663
  3853, 3,abc,  -0.0279071,  -0.0623092
  3853, 4,abc,  -0.1063892,  -0.1737632
  3854, 1,abc,   0.0098925,  -0.1398663
  3854, 2,abc,   0.0871415,  -0.1450795
  3854, 3,abc,   0.0391586,  -0.2238843
  3854, 4,abc,  -0.0449184,  -0.1040258
  3855, 1,abc,   0.0098925,  -0.1398663
  3855, 2,abc,   0.0391586,  -0.2238843
  3855, 3,abc,  -0.0610000,  -0.3000000
  3855, 4,abc,  -0.1063892,  -0.1737632
  3856, 1,abc,  -0.0035974,  -0.1029596
  3856, 2,abc,  -0.0192721,  -0.1065762
  3856, 3,abc,  -0.0610000,   0.0000000
  3856, 4,abc,   0.0590000,   0.0000000
** ... 464 like lines cut
**
*nset,nset=disp
** BOUNDARY CONDITIONS
**
** Name: BC-1 Type: Displacement/Rotation
*Boundary
_PickedSet10, 1, 1
** Name: BC-2 Type: Displacement/Rotation
*Boundary
_PickedSet11, 3, 3
_PickedSet12,1,3
_PickedSet13,1,3
*amplitude,name=ramp1
0.0,0.0,1.0,1.0,3.0,3.0
** ----------------------------------------------------------------
**
*nset,nset=print
** STEP: Step-1
**
*Step, name=Step-1, nlgeom=YES, inc=1000
*Static
0.01,1.55, 1e-09, 0.01
**
*CONTROLS,PARAMETERS=TIME INCREMENTATION
 , , , , , , ,20
*controls,type=nocutbackscaling
*dsload,amp=ramp1
efgh,P,2.5E8
**
** BOUNDARY CONDITIONS
**
** OUTPUT REQUESTS
**
** FIELD OUTPUT: F-Output-1
**
*Output, field,freq=999
*contact output,surface=efgh
csdmg,crkdisp
*element output
S,statusxfem
*node output
U,philsm
*output,history,freq=25
*node output,nset=print
u2
*End Step