*Heading
 mode I crack propagation using c3d8r with xfem
** Job name: Job-2 Model name: Model-1
** Generated by: Abaqus/CAE Version 6.9-DEV
*Preprint, echo=NO, model=NO, history=NO, contact=NO
*Node
*Element, type=C3D8R
*Nset, nset=_PickedSet2, generate
*Elset, elset=_PickedSet2, generate
** Section: Section-1
*Solid Section, elset=_PickedSet2, material=Material-1
**
*hourglass stiffness
*enrichment,elset=_PickedSet2,interaction=lower,type=propagation crack, name=abc
**
*Nset, nset=_PickedSet10
*Nset, nset=_PickedSet11
*Nset, nset=_PickedSet12
*Elset, elset=_PickedSet12
*Nset, nset=_PickedSet13
*Elset, elset=_PickedSet13
**
** MATERIALS
**
*Material, name=Material-1
*Elastic
 2.1e+11, 0.3
*DAMAGE INITIATION,CRITERION=MAXPS
8.44E7
**DAMAGE EVOLUTION,TYPE=ENERGY,MIXED MODE BEHAVIOR=POWER LAW,POWER=1.0
**4.22d4,4.22d4,4.22d4
**DAMAGE STABILIZATION
** 1.e-5
*surface interaction,name=lower
*surface behavior
*FRACTURE CRITERION,TYPE=VCCT,MIXED MODE BEHAVIOR=POWER,VISCOSITY=1.e-5
**
*initial condition,type=enrichment
     4, 1,abc,  -0.0333333,  -0.3000000
     4, 2,abc,  -0.0333333,  -0.2000000
     4, 3,abc,   0.0333333,  -0.2000000
     4, 4,abc,   0.0333333,  -0.3000000
     4, 5,abc,  -0.0333333,  -0.3000000
     4, 6,abc,  -0.0333333,  -0.2000000
     4, 7,abc,   0.0333333,  -0.2000000
     4, 8,abc,   0.0333333,  -0.3000000
     5, 1,abc,  -0.0333333,  -0.2000000
     5, 2,abc,  -0.0333333,  -0.1000000
     5, 3,abc,   0.0333333,  -0.1000000
     5, 4,abc,   0.0333333,  -0.2000000
     5, 5,abc,  -0.0333333,  -0.2000000
     5, 6,abc,  -0.0333333,  -0.1000000
     5, 7,abc,   0.0333333,  -0.1000000
     5, 8,abc,   0.0333333,  -0.2000000
     6, 1,abc,  -0.0333333,  -0.1000000
     6, 2,abc,  -0.0333333,   0.0000000
     6, 3,abc,   0.0333333,   0.0000000
     6, 4,abc,   0.0333333,  -0.1000000
** ... 172 like lines cut
**
*nset,nset=disp
*equation
_PickedSet12,2,1,9999,2,-1
**
** BOUNDARY CONDITIONS
**
** Name: BC-1 Type: Displacement/Rotation
*Boundary
_PickedSet10, 1, 1
** Name: BC-2 Type: Displacement/Rotation
*Boundary
_PickedSet11, 3, 3
*amplitude,name=ramp
0,0,1,1
** ----------------------------------------------------------------
**
** STEP: Step-1
**
*Step, name=Step-1, nlgeom=YES, inc=1000
*Static
0.01, 0.76, 1e-9, 0.01
**
*CONTROLS,PARAMETERS=TIME INCREMENTATION
 , , , , , , ,20
**
** BOUNDARY CONDITIONS
**
** Name: BC-3 Type: Displacement/Rotation
*Boundary,amp=ramp
disp, 2, 2, 0.001
**_PickedSet12, 2, 2, 0.001
** Name: BC-4 Type: Displacement/Rotation
*Boundary,amp=ramp
_PickedSet13, 2, 2, -0.001
**
** OUTPUT REQUESTS
**
** FIELD OUTPUT: F-Output-1
**
*Output, field,freq=20
*element output
S
*node output
U,philsm
**
** HISTORY OUTPUT: H-Output-1
**
*Output, history
*node output,nset=disp
rf2,u2
*End Step