*Heading
** Job name: crackprop_modeI_xfem_c3d10_v1 Model name: crackprop_modeI_xfem_c3d4
** Generated by: Abaqus/CAE 6.11-DEV
*Preprint, echo=NO, model=NO, history=NO, contact=NO
**
** PARTS
**
*Part, name=PART-1
*Node
*Element, type=C3D10
*Elset, elset=_PICKEDSET2, internal, generate
** Section: Section-1-_PICKEDSET2
*Solid Section, elset=_PICKEDSET2, material=MATERIAL-1
*End Part
**
*Part, name=Part-2
*End Part
**
**
** ASSEMBLY
**
*Assembly, name=Assembly
**
*Instance, name=PART-1-1, part=PART-1
*End Instance
**
*Instance, name=Part-2-1, part=Part-2
*End Instance
**
*Nset, nset=DISP, instance=PART-1-1
*Nset, nset=_PICKEDSET10, internal, instance=PART-1-1
*Nset, nset=_PICKEDSET11, internal, instance=PART-1-1
*Nset, nset=_PICKEDSET2, internal, instance=PART-1-1, generate
*Nset, nset=_PICKEDSET12, internal, instance=PART-1-1
*Elset, elset=_PICKEDSET12, internal, instance=PART-1-1
*Nset, nset=_PICKEDSET13, internal, instance=PART-1-1
*Elset, elset=_PICKEDSET13, internal, instance=PART-1-1
*Nset, nset=EqnSet-1, instance=PART-1-1
*Nset, nset=bot, instance=PART-1-1
*Elset, elset=_PickedSet15, internal, instance=PART-1-1, generate
*Nset, nset=_PickedSet18, internal, instance=PART-1-1
** Constraint: Eqn-1
*Equation
bot, 2, 1.
DISP, 2, -1.
*Enrichment, name=Crack-1, type=PROPAGATION CRACK, elset=_PickedSet15, interaction=LOWER
*End Assembly
*Amplitude, name=RAMP1
0,0,0.5,1,1.0,0
**
** MATERIALS
**
*Material, name=MATERIAL-1
*Elastic
 2.1e+11, 0.3
*Damage Initiation, criterion=MAXPS
8.44E7,
*surface interaction,name=lower
*surface behavior
*FRACTURE CRITERION,TYPE=FATIGUE,MIXED MODE BEHAVIOR=POWER
*Initial Conditions, type=ENRICHMENT
PART-1-1.3862, 1, Crack-1, 0.06, 0.
PART-1-1.3862, 2, Crack-1, -0.0393859, -0.0339059
PART-1-1.3862, 3, Crack-1, -0.06, 0.
PART-1-1.3862, 4, Crack-1, -0.06, 0.
PART-1-1.3862, 5, Crack-1, 0.010307, -0.016953
PART-1-1.3862, 6, Crack-1, -0.049693, -0.016953
PART-1-1.3862, 7, Crack-1, 1e-06, 0.
PART-1-1.3862, 8, Crack-1, 1e-06, 0.
PART-1-1.3862, 9, Crack-1, -0.049693, -0.016953
PART-1-1.3862, 10, Crack-1, -0.06, 0.
PART-1-1.4113, 1, Crack-1, 0.06, 0.
PART-1-1.4113, 2, Crack-1, -0.06, 0.
PART-1-1.4113, 3, Crack-1, 0.06, 0.
PART-1-1.4113, 4, Crack-1, 0.0269071, -0.0623092
PART-1-1.4113, 5, Crack-1, 1e-06, 0.
PART-1-1.4113, 6, Crack-1, 1e-06, 0.
PART-1-1.4113, 7, Crack-1, 0.06, 0.
PART-1-1.4113, 8, Crack-1, 0.0434536, -0.0311546
PART-1-1.4113, 9, Crack-1, -0.0165464, -0.0311546
PART-1-1.4113, 10, Crack-1, 0.0434536, -0.0311546
** ... 1190 like lines cut
**
** BOUNDARY CONDITIONS
**
** Name: Disp-BC-1 Type: Displacement/Rotation
*Boundary
_PICKEDSET10, 1, 1
_PICKEDSET11, 3, 3
** ----------------------------------------------------------------
**
** STEP: Step-1
**
*Step, name=Step-1, inc=1000
*direct cyclic,fatigue
*controls,type=direct cyclic
,100,1E-3,100,1E-3
** BOUNDARY CONDITIONS
**
** Name: BC-3 Type: Displacement/Rotation
*Boundary, amplitude=RAMP1
_PickedSet18, 2, 2, -0.00008
** Name: BC-4 Type: Displacement/Rotation
*Boundary, amplitude=RAMP1
DISP, 2, 2, 0.00008
** OUTPUT REQUESTS
*Output, field,freq=50
*Node Output
PHILSM, U
*Element Output
S, STATUSXFEM,ENRRTXFEM
**
** HISTORY OUTPUT: H-Output-1
*output,history,freq=50
*node output,nset=disp
rf2,u2
*End Step