*Heading
 Mixmode crack propagation using c3d8 with xfem
** Job name: crackprop_mixmode_xfem_c3d8 Model name: Model-1
** Generated by: Abaqus/CAE Version 6.9-DEV
*Preprint, echo=NO, model=yes, history=yes, contact=NO
*Node
*Element, type=C3D8
*Nset, nset=_PickedSet2, generate
*Elset, elset=_PickedSet2, generate
** Section: Section-1
*Solid Section, elset=_PickedSet2, material=Material-1
**
*enrichment,elset=_PickedSet2,interaction=lower,type=propagation crack,name=abc
**
*Nset, nset=_PickedSet4
*Nset, nset=_PickedSet5
*Elset, elset=_PickedSet5
*Nset, nset=_PickedSet6
*Elset, elset=_PickedSet6
**
** MATERIALS
**
*Material, name=Material-1
*Elastic
 2.1e+11, 0.3
*DAMAGE INITIATION,CRITERION=MAXPS
2.2E8
*DAMAGE EVOLUTION,TYPE=ENERGY,MIXED MODE BEHAVIOR=POWER LAW,POWER=1.0
4.22d4,4.22d4,4.22d4
*DAMAGE STABILIZATION
*surface interaction,name=lower
**
*initial condition,type=enrichment
  1249, 1,abc,  -0.0833333,   0.0000000
  1249, 2,abc,  -0.0833333,   0.0000000
  1249, 3,abc,  -0.0833333,  -0.2201495
  1249, 4,abc,  -0.0833333,  -0.2058965
  1249, 5,abc,   0.0833333,   0.0000000
  1249, 6,abc,   0.0833333,   0.0000000
  1249, 7,abc,   0.0833333,  -0.2201495
  1249, 8,abc,   0.0833333,  -0.2058965
  1250, 1,abc,  -0.0833333,   0.0000000
  1250, 2,abc,  -0.0833333,   0.0000000
  1250, 3,abc,  -0.0833333,  -0.2195140
  1250, 4,abc,  -0.0833333,  -0.2201495
  1250, 5,abc,   0.0833333,   0.0000000
  1250, 6,abc,   0.0833333,   0.0000000
  1250, 7,abc,   0.0833333,  -0.2195140
  1250, 8,abc,   0.0833333,  -0.2201495
  1251, 1,abc,  -0.0833333,   0.0000000
  1251, 2,abc,  -0.0833333,   0.0000000
  1251, 3,abc,  -0.0833333,  -0.2154411
  1251, 4,abc,  -0.0833333,  -0.2195140
** ... 348 like lines cut
**
** BOUNDARY CONDITIONS
**
** Name: BC-1 Type: Displacement/Rotation
*Boundary
_PickedSet4, 3, 3
**
*nset,nset=disp
*equation
_PickedSet6,1,1,9999,1,-1
*amplitude,name=ramp1
0.0,0.0,1.0,1.0
** ----------------------------------------------------------------
**
** STEP: Step-1
**
*Step, name=Step-1, nlgeom=YES, inc=1000
*Static
0.05, 0.218, 1e-09, 0.05
**
*CONTROLS,PARAMETERS=TIME INCREMENTATION
 , , , , , , ,20
**
** BOUNDARY CONDITIONS
**
** Name: BC-2 Type: Displacement/Rotation
*Boundary,amp=ramp1
_PickedSet5, 1, 1, -0.01
_PickedSet5, 2, 2, 0.005
** Name: BC-3 Type: Displacement/Rotation
*Boundary,amp=ramp1
disp, 1, 1,0.01
_PickedSet6, 2, 2, -0.005
**
** OUTPUT REQUESTS
**
**Restart, write, frequency=0
**
*Output, field
*element output
S
*node output
U,philsm
**
** HISTORY OUTPUT: H-Output-1
**
*Output, history
*node output,nset=disp
rf1,u1
*End Step