*Heading
 crackprop_mixmode_xfem_C3D10
** Job name: crackprop_mixmode_xfem_C3D10
** Generated by: Abaqus/CAE 6.11-DEV
*Preprint, echo=NO, model=NO, history=NO, contact=NO
**
** PARTS
**
*Part, name=PART-1
*Node
*Element, type=C3D10
*Elset, elset=_PICKEDSET2, internal, generate
** Section: Section-1-_PICKEDSET2
*Solid Section, elset=_PICKEDSET2, material=MATERIAL-1
*End Part
**
*Part, name=crack
*End Part
**
**
** ASSEMBLY
**
*Assembly, name=Assembly
**
*Instance, name=PART-1-1, part=PART-1
*End Instance
**
*Instance, name=crack-1, part=crack
*End Instance
**
*Nset, nset=DISP, instance=PART-1-1
*Nset, nset=_PICKEDSET2, internal, instance=PART-1-1
*Nset, nset=_PICKEDSET10, internal, instance=PART-1-1
*Elset, elset=_PICKEDSET10, internal, instance=PART-1-1
*Nset, nset=_PICKEDSET11, internal, instance=PART-1-1
*Elset, elset=_PICKEDSET11, internal, instance=PART-1-1
*Nset, nset=EqnSet-1, instance=PART-1-1
*Nset, nset=_PickedSet12, internal, instance=PART-1-1
*Nset, nset=_PickedSet14, internal, instance=PART-1-1
*Elset, elset=_PickedSet15, internal, instance=PART-1-1, generate
*Nset, nset=bot, instance=PART-1-1
** Constraint: Eqn-1
*Equation
bot, 1, 1.
DISP, 1, -1.
*Enrichment, name=Crack-1, type=PROPAGATION CRACK, elset=_PickedSet15, interaction=LOWER
*End Assembly
*Amplitude, name=RAMP1
          0.,           0.,           1.,           1.
**
** MATERIALS
**
*Material, name=MATERIAL-1
*Damage Initiation, criterion=MAXPS,tol=0.1
 2.2e+08,
*Damage Evolution, type=ENERGY, mixed mode behavior=POWER LAW, power=1.
42200.,42200.,42200.
*Damage Stabilization
*Elastic
 2.1e+11, 0.3
**
** INTERACTION PROPERTIES
**
*Surface Interaction, name=LOWER
1.,
*Initial Conditions, type=ENRICHMENT
PART-1-1.10, 1, Crack-1, 0.05, 0.
PART-1-1.10, 2, Crack-1, -0.05, -0.157254
PART-1-1.10, 3, Crack-1, 0.05, 0.
PART-1-1.10, 4, Crack-1, -0.05, 0.
PART-1-1.10, 5, Crack-1, 1e-06, -0.0786269
PART-1-1.10, 6, Crack-1, 1e-06, -0.0786269
PART-1-1.10, 7, Crack-1, 0.05, 0.
PART-1-1.10, 8, Crack-1, 1e-06, 0.
PART-1-1.10, 9, Crack-1, -0.05, -0.0786269
PART-1-1.10, 10, Crack-1, 1e-06, 0.
PART-1-1.54, 1, Crack-1, 0.05, 0.
PART-1-1.54, 2, Crack-1, -0.05, 0.
PART-1-1.54, 3, Crack-1, -0.05, -0.157254
PART-1-1.54, 4, Crack-1, -0.05, 0.
PART-1-1.54, 5, Crack-1, 1e-06, 0.
PART-1-1.54, 6, Crack-1, -0.05, -0.0786269
PART-1-1.54, 7, Crack-1, 1e-06, -0.0786269
PART-1-1.54, 8, Crack-1, 1e-06, 0.
PART-1-1.54, 9, Crack-1, -0.05, 0.
PART-1-1.54, 10, Crack-1, -0.05, -0.0786269
** ... 650 like lines cut
**
** BOUNDARY CONDITIONS
**
** Name: Disp-BC-1 Type: Displacement/Rotation
*Boundary
_PICKEDSET2, 3, 3
** ----------------------------------------------------------------
**
** STEP: Step-1
**
*Step, name=Step-1, inc=1000,nlgeom
*Static
0.01, 0.2595, 1e-09, 0.01
**
*CONTROLS,PARAMETERS=TIME INCREMENTATION
 , , , , , , ,20
*Boundary, amplitude=RAMP1
DISP, 1, 1, 0.01
bot,2,2,-0.005
** Name: top Type: Displacement/Rotation
*Boundary, amplitude=RAMP1
_PickedSet14, 1, 1, -0.01
_PickedSet14,2,2,0.005
**
** OUTPUT REQUESTS
**
*Output, field,freq=10
*Node Output
PHILSM,U
*Element Output
S, STATUSXFEM
*output,history,freq=20
*node output,nset=disp
rf1,u1
*End Step