*HEADING
 PLATE WITH A PART THROUGH CRACK: LS6 ELEMENTS
*RESTART,WRITE
*NODE
*NGEN,NSET=ONY
*NGEN,NSET=FREE
*NGEN,NSET=TOP
*NSET,NSET=ONX
*NCOPY, OLD SET=TOP, NEW SET=BOTTOM,
CHANGE NUMBER=10000, REFLECT=LINE
*NSET,NSET=NALL
TOP,BOTTOM
*NSET,NSET=ONY,GENERATE
*NSET,NSET=ONX1
*MPC
TIE,ONX,ONX1
*ELEMENT,TYPE=S8R,ELSET=SHELLT
*ELGEN,ELSET=SHELLT
*ELCOPY, ELEMENT SHIFT=10000, OLD SET=SHELLT,
NEW SET=SHELLB,SHIFT NODES=10000
*ELEMENT,TYPE=LS6,ELSET=LS
*ELGEN,ELSET=LS
*ELSET,ELSET=SALL
SHELLT,SHELLB,LS
*ELSET,ELSET=SHELLS
SHELLT,SHELLB
*NORMAL
SALL,NALL,0.,0.,1.
*ELSET,ELSET=PRINT
*MATERIAL,NAME=A1
*ELASTIC
 30.E6,.3
*SHELL SECTION,ELSET=SHELLS,MATERIAL=A1
.75,3
*SHELL SECTION,ELSET=LS,MATERIAL=A1
.75,
*SURFACE FLAW,SIDE=POSITIVE
*ELSET,ELSET=TOPL
*ELSET,ELSET=BOTL
*MPC
QUADRATIC,203,201,205,209
QUADRATIC,207,201,205,209
QUADRATIC,211,209,213,217
QUADRATIC,215,209,213,217
QUADRATIC,218,217,219,221
QUADRATIC,220,217,219,221
QUADRATIC,222,221,223,225
QUADRATIC,224,221,223,225
QUADRATIC,1405,1401,1409,1417
QUADRATIC,1413,1401,1409,1417
QUADRATIC,1423,1421,1425,1429
QUADRATIC,1427,1421,1425,1429
QUADRATIC,1433,1429,1437,1445
QUADRATIC,1441,1429,1437,1445
QUADRATIC,1449,1445,1453,1461
QUADRATIC,1457,1445,1453,1461
QUADRATIC,10203,10201,10205,10209
QUADRATIC,10207,10201,10205,10209
QUADRATIC,10211,10209,10213,10217
QUADRATIC,10215,10209,10213,10217
** ... 12 like lines cut
*BOUNDARY
  ONY,1
  ONY,5,6
 4897,3
14897,3
10097,2
10097,4
*STEP
*STATIC
*CLOAD
 10025,1,0.,
10025,2,0.
10025,3,0.
10025,4,0.
10025,5,0.
10025,6,0.
 4801,4,-100.
 4809,4,-400.
*EL FILE
JK,
*END STEP