*Heading
Single edge notch
*preprint, echo=NO, history=NO, model=NO, contact=NO
** ----------------------------------------------------------------
** PART INSTANCE: PART-1-1
**
*Node
*Element, type=C3D8
*Nset, nset=ASSEMBLY_PART-1-1__PICKEDSET2
*Elset, elset=ASSEMBLY_PART-1-1__PICKEDSET2
*solidsection, elset=ASSEMBLY_PART-1-1__PICKEDSET2, material=MATERIAL-1
*enrichment, name=abc, type=STATIONARYCRACK, elset=ASSEMBLY_PART-1-1__PICKEDSET2, interaction=LOWER, enrichmentradius=0.5
*surface, type=ELEMENT, name=ASSEMBLY__PICKEDSURF11
ASSEMBLY___PICKEDSURF11_S5, S5
**
** Assembly Nsets
**
*Nset, nset=ASSEMBLY__PICKEDSET10
*Nset, nset=ASSEMBLY__PICKEDSET8
*Nset, nset=ASSEMBLY__PICKEDSET9
**
** Assembly Elsets
**
*Elset, elset=ASSEMBLY___PICKEDSURF11_S5
*material, name=MATERIAL-1
*elastic
2.1E+11, 0.3
*surfaceinteraction, name=LOWER
*initialconditions, type=ENRICHMENT
  2301, 1,abc,  -0.0454545,  -0.1000000
  2301, 2,abc,  -0.0454545,  -0.1000000
  2301, 3,abc,   0.0454545,  -0.1000000
  2301, 4,abc,   0.0454545,  -0.1000000
  2301, 5,abc,  -0.0454545,   0.0000000
  2301, 6,abc,  -0.0454545,   0.0000000
  2301, 7,abc,   0.0454545,   0.0000000
  2301, 8,abc,   0.0454545,   0.0000000
  2302, 1,abc,  -0.0454545,  -0.1000000
  2302, 2,abc,  -0.0454545,  -0.1000000
  2302, 3,abc,   0.0454545,  -0.1000000
  2302, 4,abc,   0.0454545,  -0.1000000
  2302, 5,abc,  -0.0454545,   0.0000000
  2302, 6,abc,  -0.0454545,   0.0000000
  2302, 7,abc,   0.0454545,   0.0000000
  2302, 8,abc,   0.0454545,   0.0000000
  2303, 1,abc,  -0.0454545,  -0.1000000
  2303, 2,abc,  -0.0454545,  -0.1000000
  2303, 3,abc,   0.0454545,  -0.1000000
  2303, 4,abc,   0.0454545,  -0.1000000
** ... 1580 like lines cut
*boundary
ASSEMBLY__PICKEDSET8, 1, 1
*boundary
ASSEMBLY__PICKEDSET9, 3, 3
*boundary
ASSEMBLY__PICKEDSET10, 2, 2
*Step, name=Step-1
*static
1., 1., 1E-05, 1.
*dsload
ASSEMBLY__PICKEDSURF11, P, -1E+10
**restart, write, frequency=0
*output, field
*elementoutput
S, STATUSXFEM
*nodeoutput
U, PHILSM
*output, history
*contour integral,contour=5,crack name=abc,xfem
*contour integral,contour=5,crack name=abc,xfem,type=k factor
**contour integral,contour=5,crack name=abc,xfem,type=t-stress
*endstep