*Heading
Single edge notch
*preprint, echo=NO, history=YES, model=YES
** ----------------------------------------------------------------
** PART INSTANCE: PART-1-1
**
*Node
*Element, type=C3D4
*Nset, nset=ASSEMBLY_PART-1-1__PICKEDSET2
*Elset, elset=ASSEMBLY_PART-1-1__PICKEDSET2
*solidsection, elset=ASSEMBLY_PART-1-1__PICKEDSET2, material=MATERIAL-1
** ----------------------------------------------------------------
** PART INSTANCE: PART-3-1
**
*surface, type=ELEMENT, name=ASSEMBLY__PICKEDSURF11
ASSEMBLY___PICKEDSURF11_S2, S2
ASSEMBLY___PICKEDSURF11_S3, S3
ASSEMBLY___PICKEDSURF11_S4, S4
ASSEMBLY___PICKEDSURF11_S1, S1
*enrichment, name=CRACK-1, type=STATIONARYCRACK, elset=ASSEMBLY__PICKEDSET26, interaction=LOWER, enrichmentradius=0.5
**
** Assembly Nsets
**
*Nset, nset=ASSEMBLY__PICKEDSET10
*Nset, nset=ASSEMBLY__PICKEDSET26
*Nset, nset=ASSEMBLY__PICKEDSET8
*Nset, nset=ASSEMBLY__PICKEDSET9
**
** Assembly Elsets
**
*Elset, elset=ASSEMBLY__PICKEDSET26
*Elset, elset=ASSEMBLY___PICKEDSURF11_S1
*Elset, elset=ASSEMBLY___PICKEDSURF11_S2
*Elset, elset=ASSEMBLY___PICKEDSURF11_S3
*Elset, elset=ASSEMBLY___PICKEDSURF11_S4
*material, name=MATERIAL-1
*elastic
2.1E+11, 0.3
*surfaceinteraction, name=LOWER
*initialconditions, type=ENRICHMENT
103, 1, CRACK-1, -0.0101336, -0.0255772
103, 2, CRACK-1, 0.0436314, 0.00147128
103, 3, CRACK-1, 0.00422141, 0.0910133
103, 4, CRACK-1, 0.112109, 0.0232267
104, 1, CRACK-1, -0.0101336, -0.0255772
104, 2, CRACK-1, 0.00422141, 0.0910133
104, 3, CRACK-1, 0.0436314, 0.00147128
104, 4, CRACK-1, -0.0807664, 0.000925053
1107, 1, CRACK-1, -0.0101336, -0.0255772
1107, 2, CRACK-1, -0.0807664, 0.000925053
1107, 3, CRACK-1, 0.0436314, 0.00147128
1107, 4, CRACK-1, 0.0318376, -0.088884
1718, 1, CRACK-1, -0.0101336, -0.0255772
1718, 2, CRACK-1, 0.112109, 0.0232267
1718, 3, CRACK-1, 0.00422141, 0.0910133
1718, 4, CRACK-1, 0.0715403, 0.0408204
893, 1, CRACK-1, -0.0101336, -0.0255772
893, 2, CRACK-1, 0.0715403, 0.0408204
893, 3, CRACK-1, 0.00422141, 0.0910133
893, 4, CRACK-1, -0.0474134, 0.0400972
** ... 5040 like lines cut
*boundary
ASSEMBLY__PICKEDSET8, 1, 1
*boundary
ASSEMBLY__PICKEDSET9, 3, 3
*boundary
ASSEMBLY__PICKEDSET10, 2, 2
*Step, name=Step-1
*static
1., 1., 1E-05, 1.
*dsload
ASSEMBLY__PICKEDSURF11, P, -1E+10
*restart, write, frequency=0
*output, field
*elementoutput
S, STATUSXFEM
*nodeoutput
PHILSM
*output, history
*contour integral,contour=5,crack name=Crack-1,xfem
*contour integral,contour=5,crack name=Crack-1,xfem,type=k factor
*endstep