*Heading
** Job name: rec-plate-tet-30 Model name: Model-8
** Generated by: Abaqus/CAE 6.9-EFR
*Preprint, echo=NO, model=NO, history=NO, contact=NO
**
** PARTS
**
*Part, name=Part-1
*End Part
**
*Part, name=Part-2
*End Part
**
**
** ASSEMBLY
**
*Assembly, name=Assembly
**
*Instance, name=Part-1-1, part=Part-1
*Node
*Element, type=C3D4
*Nset, nset=_PickedSet8, internal, generate
*Elset, elset=_PickedSet8, internal, generate
** Section: Section-1
*Solid Section, elset=_PickedSet8, material=Material-1
*End Instance
**
*Instance, name=Part-2-1, part=Part-2
*End Instance
**
*Nset, nset=_PickedSet39, internal, instance=Part-1-1
*Elset, elset=_PickedSet39, internal, instance=Part-1-1
*Nset, nset=top, instance=Part-1-1
*Elset, elset=top, instance=Part-1-1, generate
*Nset, nset=bottom, instance=Part-1-1
*Elset, elset=bottom, instance=Part-1-1, generate
*Nset, nset=back, instance=Part-1-1
*Elset, elset=back, instance=Part-1-1, generate
*Nset, nset=front, instance=Part-1-1
*Elset, elset=front, instance=Part-1-1, generate
*Nset, nset=crackfront, instance=Part-1-1
*Elset, elset=crackfront, instance=Part-1-1, generate
*Nset, nset=middle, instance=Part-1-1
*Elset, elset=middle, instance=Part-1-1, generate
*Nset, nset=_PickedSet189, internal, instance=Part-1-1
*Elset, elset=_PickedSet189, internal, instance=Part-1-1, generate
*Nset, nset=nset-back-bottom, instance=Part-1-1
*Nset, nset=nset-back-top, instance=Part-1-1
*Elset, elset=__PickedSurf41_S1, internal, instance=Part-1-1
*Elset, elset=__PickedSurf41_S3, internal, instance=Part-1-1
*Elset, elset=__PickedSurf41_S2, internal, instance=Part-1-1
*Elset, elset=__PickedSurf41_S4, internal, instance=Part-1-1
*Surface, type=ELEMENT, name=_PickedSurf41, internal
__PickedSurf41_S1, S1
__PickedSurf41_S3, S3
__PickedSurf41_S2, S2
__PickedSurf41_S4, S4
*Enrichment, name=Crack-1, type=STATIONARY CRACK, elset=_PickedSet189
**, enrichment radius=0.2
*End Assembly
**
** MATERIALS
**
*Material, name=Material-1
*Elastic
 3e+07, 0.3
*Initial condition, type=ENRICHMENT
Part-1-1.239817, 1, Crack-1, 0.033607, 0.0688079
Part-1-1.239817, 2, Crack-1, -0.00481486, 0.000177847
Part-1-1.239817, 3, Crack-1, -0.0152382, -0.000823332
Part-1-1.239817, 4, Crack-1, 0.0561976, 0.000207061
Part-1-1.244154, 1, Crack-1, -0.00608838, -0.0416339
Part-1-1.244154, 2, Crack-1, -0.0152382, -0.000823332
Part-1-1.244154, 3, Crack-1, -0.00481486, 0.000177847
Part-1-1.244154, 4, Crack-1, 0.0561976, 0.000207061
Part-1-1.241497, 1, Crack-1, -0.0152382, -0.000823332
Part-1-1.241497, 2, Crack-1, -0.00608838, -0.0416339
Part-1-1.241497, 3, Crack-1, 0.00730312, 0.000643599
Part-1-1.241497, 4, Crack-1, 0.0561976, 0.000207061
Part-1-1.242900, 1, Crack-1, -0.00608838, -0.0416339
Part-1-1.242900, 2, Crack-1, 0.00730312, 0.000643599
Part-1-1.242900, 3, Crack-1, -0.0668604, 0.00072983
Part-1-1.242900, 4, Crack-1, -0.0152382, -0.000823332
Part-1-1.243573, 1, Crack-1, -0.00608838, -0.0416339
Part-1-1.243573, 2, Crack-1, -0.0111293, -0.0696551
Part-1-1.243573, 3, Crack-1, -0.0668604, 0.00072983
Part-1-1.243573, 4, Crack-1, 0.00730312, 0.000643599
** ... 9720 like lines cut
** ----------------------------------------------------------------
**
** STEP: Step-1
**
*Step, name=Step-1
*Static
1., 1., 1e-05, 1.
**
** BOUNDARY CONDITIONS
**
** Name: BC-2 Type: Displacement/Rotation
*Boundary
nset-back-top, 2, 2
nset-back-top, 3, 3
** Name: BC-3 Type: Displacement/Rotation
*Boundary
nset-back-bottom, 2, 2
nset-back-bottom, 3, 3
** Name: X-symm Type: Symmetry/Antisymmetry/Encastre
*Boundary
_PickedSet39, XSYMM
**
** LOADS
**
** Name: Load-1   Type: Pressure
*Dsload
_PickedSurf41, P, -1.
**
** OUTPUT REQUESTS
**
** FIELD OUTPUT: F-Output-1
**
*Output, field
*Node Output
PHILSM, PSILSM,U
*Element Output
S, STATUSXFEM
**
** HISTORY OUTPUT: H-Output-1
**
*Output, history, variable=PRESELECT
**
** HISTORY OUTPUT: H-Output-2
**
*Contour integral, crack name=Crack-1, contours=8, xfem=line
**
** HISTORY OUTPUT: H-Output-3
**
*Contour integral, crack name=Crack-1, contours=8, type=K FACTORS, xfem=line
**
** HISTORY OUTPUT: H-Output-4
**
*Contour integral, crack name=Crack-1, contours=8, type=T-STRESS, xfem=line
*End Step