*Heading
Beam problem
***Compare with std-xpl cosimulation jobs contbeam_rot_statodyn_lockstep_std.inp
***and contbeam_rot_statodyn_lockstep_xpl.inp
*preprint, echo=NO, history=NO, model=NO, contact=NO
** ----------------------------------------------------------------
** PART INSTANCE: PART-1-1
**
*Node
*Element, type=C3D8I
*Nset, nset=ASSEMBLY_PART-1-1__PICKEDSET12
*Elset, elset=ASSEMBLY_PART-1-1__PICKEDSET12
*solidsection, elset=ASSEMBLY_PART-1-1__PICKEDSET12, material=MATERIAL-1
*surface, type=ELEMENT, name=ASSEMBLY__PICKEDSURF17
ASSEMBLY___PICKEDSURF17_S3, S3
*coupling, constraintname=ASSEMBLY_CONSTRAINT-1, refnode=ASSEMBLY__PICKEDSET18, surface=ASSEMBLY__PICKEDSURF17
*kinematic
*Node
**
*element, type=s4r, elset=shellelems
*shellsection, material=material-1,elset=shellelems
*element, type=B31, elset=beamelement
*beamsection, material=material-1, elset=beamelement, section=rect
** Assembly Nsets
**
*Nset, nset=ASSEMBLY_SET-1
*Nset, nset=ASSEMBLY_SET-2
*Nset, nset=ASSEMBLY__PICKEDSET18
*Nset, nset=ASSEMBLY__PICKEDSET19
*Nset, nset=ASSEMBLY__PICKEDSET6
**
** Assembly Elsets
**
*Elset, elset=ASSEMBLY___PICKEDSURF17_S3
*amplitude, name=AMP-2
0., 0., 1., 1.
*amplitude, name=RAMP1
0., 0.0, 1.0, 1.0,
*material, name=MATERIAL-1
*density
10.,
*elastic
1000000000., 0.1
*material, name=MATERIAL-2
*density
1E-08,
*elastic
100000., 0.1
*Step, name=Step-1, nlgeom=yes
*dynamic, explicit
, 1.
*boundary
ASSEMBLY__PICKEDSET19, 1, 1
ASSEMBLY__PICKEDSET19, 2, 2
ASSEMBLY__PICKEDSET19, 3, 3
ASSEMBLY__PICKEDSET19, 4, 4
ASSEMBLY__PICKEDSET19, 5, 5
ASSEMBLY__PICKEDSET19, 6, 6
*cload, amplitude=RAMP1
ASSEMBLY__PICKEDSET6, 1, 0.
ASSEMBLY__PICKEDSET6, 2, -2000.
*output, field
*node output
U,
*output, history
*nodeoutput, nset=ASSEMBLY_SET-2
U1, U2, U3, UR1, UR2,UR3,
*output, history
*nodeoutput, nset=ASSEMBLY__PICKEDSET6
U1, U2, U3,
*output, history, variable=PRESELECT
*endstep