*Heading
std-xpl co-simulation with C3D8I elements
*preprint, echo=NO, history=NO, model=NO, contact=NO
** ----------------------------------------------------------------
** PART INSTANCE: PART-1-1
**
*Node
*Element, type=C3D8I
*Nset, nset=ASSEMBLY_PART-1-1__PICKEDSET4
*Elset, elset=ASSEMBLY_PART-1-1__PICKEDSET4
*solidsection, elset=ASSEMBLY_PART-1-1__PICKEDSET4, material=MATERIAL-1
**
** Assembly Nsets
**
*Nset, nset=ASSEMBLY_SET-1
*Nset, nset=ASSEMBLY_SET-2
*nset, nset=all_retained_nodes, unsorted
*material, name=MATERIAL-1
*density
1.,
*elastic
100000., 0.1
*coupling, constraintname=ASSEMBLY_CONSTRAINT-1, refnode=ASSEMBLY_FIX, surface=ASSEMBLY__PICKEDSURF8
*kinematic
*Node
*Nset, nset=ASSEMBLY_FIX
*surface, type=node, name=ASSEMBLY__PICKEDSURF8
ASSEMBLY_SET-1,
*nset,nset=cn, unsorted
*surface, type=node, name=surfcn
CN,
*step, inc=100001, nlgeom=yes
*dynamic,alpha=0.,haftol=10000.
0.01,4.0,,0.05
*boundary
1000,1,6
*co-simulation controls, name=ctrl, time incrementation=subcycle
*co-simulation, name=exp_std, program=abaqus, controls=ctrl
*co-simulation region, type=node
CN,
****
**
**
*output, field, number interval=10, time marks=no
*node output
U,
*output, history
*node output, nset=cn
U1,U2,U3
***
***
*end step