*Heading
std-xpl co-simulation with C3D8I elements
*preprint, echo=NO, history=NO, model=NO, contact=NO
** ----------------------------------------------------------------
** PART INSTANCE: PART-1-1
**
*Node
*Element, type=C3D8I
*Nset, nset=ASSEMBLY_PART-1-1__PICKEDSET10
*Nset, nset=ASSEMBLY_PART-1-1__PICKEDSET11
*Elset, elset=ASSEMBLY_PART-1-1__PICKEDSET10
*Elset, elset=ASSEMBLY_PART-1-1__PICKEDSET11
*solidsection, elset=ASSEMBLY_PART-1-1__PICKEDSET10, material=MATERIAL-1
*solidsection, elset=ASSEMBLY_PART-1-1__PICKEDSET11, material=MATERIAL-2
**
** Assembly Nsets
**
*Nset, nset=ASSEMBLY_SET-1, unsorted
*Nset, nset=ASSEMBLY__PICKEDSET6
*material, name=MATERIAL-1
*density
1.,
*elastic
100000., 0.1
*material, name=MATERIAL-2
*density
1.,
*elastic
100000., 0.1
*amplitude, name=ramp1
0.,0.0,  0.2, 1.0, 0.3,0 ,1., 0.
*surface, type=node, name=cnsurf
ASSEMBLY_SET-1,
*Step, name=Step-1
*dynamic, explicit
, 5.0
*bulkviscosity
*cload, amplitude=ramp1
ASSEMBLY__PICKEDSET6, 2, -200.
*co-simulation controls, name=ctrl, time incrementation=subcycle
*co-simulation, name=exp_std, program=abaqus, controls=ctrl
*co-simulation region, type=node
ASSEMBLY_SET-1,
***
*output, field, number interval=10
*node output
U,V,
*output, history
*node output, nset=ASSEMBLY__PICKEDSET6
U1,U2,U3
*node output, nset=ASSEMBLY_SET-1
U1,U2,U3
***
***
*endstep